program: Gaussian 09
title: 000264869
version: EM64L-G09RevD.01
frameworkgroup: C1[X(C21H22O2)]
method: RPBEPBE
basis: SDD
operation: Freq
keyword: #pfreq=noraman
keyword: PBEPBE/SDD
title: #p freq=noraman PBEPBE/SDD
converged: YES YES NO NO
title: Mulliken charges:
elementType: O O C C C C C C C C C C C C C C C C C C C C C H H H H H H H H H H H H H H H H H H H H H H
charge: -0.164835 -0.189307 -0.152141 -0.153644 -0.434293 -0.438231 -0.422476 0.051329 0.088670 -0.620776 -0.613916 0.505931 0.496975 -0.435379 -0.417866 -0.400286 -0.402799 -0.229388 -0.228356 -0.233157 -0.231669 -0.242215 -0.240219 0.275455 0.281597 0.241556 0.220267 0.222358 0.218314 0.211445 0.209049 0.217139 0.257216 0.207308 0.241941 0.233414 0.225887 0.234279 0.257035 0.225371 0.221892 0.226150 0.224431 0.229331 0.226612
chargesum: 0.00000
title: Mulliken charges with hydrogens summed into heavy atoms:
elementType: O O C C C C C C C C C C C C C C C C C C C C C
charge: -0.164835 -0.189307 0.123314 0.127953 0.027530 0.002441 -0.001982 0.051329 0.088670 -0.146421 -0.164666 0.505931 0.496975 -0.201965 -0.191979 -0.166008 -0.145763 -0.004017 -0.006464 -0.007007 -0.007238 -0.012884 -0.013606
polarizability: 2.86423429e+02 -2.20380299e+01 2.03823299e+02 2.64304248e+01 2.01163047e+01 1.69381062e+02
1716.lowfreq: -3.0864 0.0006 0.0009 0.0010 3.3935 10.3379 16.6312 20.8764 28.7945
frequency: 16.2932 18.8184 28.3358 30.1341 48.4452 60.8245 72.4775 97.7329 126.4660 146.2076 173.9437 197.7777 205.3747 239.8487 253.9661 274.0402 332.4688 340.0580 347.1130 361.9496 368.2651 403.2107 404.4488 422.9600 472.8617 493.7238 516.8026 552.7678 577.6910 617.4197 618.6786 626.7560 640.3230 705.2976 705.8560 727.9053 746.3258 758.6716 761.1677 784.7206 808.7502 840.1786 844.5861 854.1293 855.7647 859.1738 884.5993 917.1745 921.2194 927.2906 938.7936 976.1546 978.0275 989.7358 990.0374 994.1499 995.1912 995.8129 1009.3742 1025.1005 1027.4869 1029.9352 1053.5582 1060.6810 1081.2319 1091.9576 1111.0459 1141.2932 1159.6642 1171.8189 1172.1895 1180.6652 1187.4989 1188.4132 1190.3251 1205.7663 1215.8522 1217.4786 1234.9083 1255.9233 1271.7580 1284.7594 1309.3236 1319.0410 1325.0655 1333.4264 1335.2995 1339.8232 1341.9983 1363.0576 1382.2478 1383.6980 1439.8847 1442.6674 1458.0742 1463.6084 1465.9378 1469.9703 1473.9254 1483.9804 1484.5282 1592.1348 1593.7594 1603.1805 1606.5140 1614.2154 1615.2798 2956.6212 2969.8993 2973.9802 2988.4573 2992.2005 2992.9886 2998.1875 3032.4823 3040.7178 3050.3291 3052.8803 3054.3063 3108.8946 3112.2194 3113.3640 3124.0319 3131.3813 3135.8745 3143.3719 3147.0009 3162.4724 3162.6056
redmass: 6.2709 4.3794 4.3336 4.3183 4.9181 3.9328 5.3251 7.0960 3.3416 5.8678 4.5179 4.5665 5.2114 3.1462 3.1778 4.8327 2.7493 2.9164 2.1798 3.7488 3.7468 2.8291 2.8299 2.2641 2.7672 3.4483 2.8737 4.9395 4.5632 6.3273 6.2469 3.9152 4.3107 1.8990 1.8211 2.9174 1.8652 2.6061 2.1443 2.9395 3.6710 2.2362 2.7813 1.2546 1.2540 2.3542 2.4800 1.5909 1.6718 1.6431 2.4542 1.3876 1.3994 5.9121 4.8564 1.6913 1.4256 1.4165 2.7947 2.4678 2.2132 2.1952 2.0502 2.4900 1.6589 1.6791 1.8429 1.4155 2.0473 1.0609 1.0560 1.2551 1.1402 1.1208 1.2849 1.5536 2.5163 2.3302 1.2243 1.3335 1.4739 1.2489 1.3087 1.4474 1.3399 1.3037 1.2936 1.4223 1.4335 1.5939 7.4425 6.4454 2.1540 2.1544 1.0939 1.0805 1.1063 1.1158 1.0937 2.2395 2.3079 6.0212 6.0558 12.0439 10.0310 6.2288 6.1861 1.0788 1.0648 1.0610 1.0725 1.0649 1.0686 1.0600 1.0973 1.1028 1.1001 1.1012 1.1011 1.0875 1.0882 1.0868 1.0859 1.0901 1.0914 1.0955 1.0959 1.1014 1.1015
irintensity: 0.3896 0.1352 0.0295 0.7543 0.7070 0.4518 1.2609 1.4375 2.1974 1.6650 0.8425 4.3307 4.5374 0.8056 9.0808 2.7971 0.1557 1.1334 3.6210 2.9417 6.3114 0.0249 0.0868 1.0330 5.2616 26.3995 20.3344 4.6441 5.0895 0.0931 0.3032 1.6305 2.0540 65.1022 32.6331 4.2662 61.2958 1.2629 25.9357 6.2422 1.1032 35.3454 1.6532 0.0426 0.5440 8.4204 32.0109 0.2774 6.5527 9.9186 14.8177 0.0394 0.5997 0.1486 0.1174 0.8285 0.3392 2.8409 15.1405 2.0825 16.6489 2.7473 6.3345 4.7373 4.3895 28.4747 1.2486 2.8846 11.7771 0.3135 0.1298 23.9156 2.2519 0.7903 2.4981 4.9505 0.3680 0.9228 3.2977 1.4332 10.7451 4.2542 5.7501 1.9828 2.8963 1.1643 2.0933 2.4831 2.0485 5.1402 0.1233 0.3110 7.1754 6.7780 1.2976 7.6773 9.9831 16.2366 17.9195 26.2848 16.2699 1.4324 2.6974 102.9238 71.7061 12.2219 10.6889 6.2648 17.9415 18.7855 4.0512 22.9380 28.2649 14.9506 41.1127 27.8781 20.0964 10.2799 23.0067 11.8430 6.1126 15.0229 0.1016 8.2880 20.5600 39.4865 33.9350 32.6072 16.4267
temp: 298.150 k
press: 1.00000 atm
elementType: 8 8 6 6 6 6 6 6 6 6 6 6 6 6 6 6 6 6 6 6 6 6 6 1 1 1 1 1 1 1 1 1 1 1 1 1 1 1 1 1 1 1 1 1 1
symmnumber: 1
zpe: 975569.5 jmol-1
zpe.correction: 0.371575 hartree
zpe.thermalcorrener: 0.392272 hartree
zpe.thermalcorrenthalpy: 0.393216 hartree
zpe.thermalcorrgfe: 0.318524 hartree
zpe.sumelectzpe: -962.210688 hartree
zpe.sumelectthermal: -962.189990 hartree
zpe.sumelectthermalent: -962.189046 hartree
zpe.sumelectthermalfe: -962.263738 hartree
dipole: -1.7982 3.4396 -0.0452
dipole: 3.8815
quadrupole: -128.7443 -127.8284 -140.7719
quadrupole: -0.5742 7.4024 6.2388
quadrupole: 3.7039 4.6198 -8.3237 -0.5742 7.4024 6.2388
hfenergy: -962.5822626 hartree
pointgroup: C01 [X(C21H22O2)]
dipole: -0.7005367 -1.0609259 -0.8460277 debye
polarizability: 284.4068673|37.1009895|171.2984025|-8.1619222|19.3529553|203.9225198 unknown
InChI: InChI=1S/C21H22O2/c22-20-18(14-16-8-3-1-4-9-16)12-7-13-19(21(20)23)15-17-10-5-2-6-11-17/h1-6,8-11,18-19H,7,12-15H2
charge 0 multiplicity 1
45 atoms
O  0.071346 1.87569 -0.318492
O  1.205276 -0.52836 1.624983
C  -1.590306 0.106042 0.162089
C  1.685959 -0.856088 -0.778728
C  -1.573555 -1.369667 -0.358983
C  0.763354 -1.977742 -1.379732
C  -0.721978 -1.607128 -1.641675
C  -0.189379 0.704105 0.060987
C  0.96242 -0.253001 0.419767
C  -2.643181 1.007141 -0.544189
C  3.084079 -1.426826 -0.409635
C  -4.071178 0.652766 -0.156399
C  4.144141 -0.352936 -0.2016
C  -4.94107 -0.002308 -1.065015
C  4.863575 0.169158 -1.30823
C  -4.561808 0.964869 1.139617
C  4.424005 0.159142 1.09168
C  -6.262665 -0.341928 -0.692064
C  5.835265 1.179471 -1.131167
C  -5.879692 0.627955 1.517389
C  5.396252 1.168727 1.272632
C  -6.735876 -0.029913 0.602354
C  6.105058 1.68323 0.162539
H  -1.826639 0.06798 1.248354
H  1.790779 -0.056414 -1.539794
H  -2.624958 -1.653645 -0.54734
H  -1.210233 -2.044005 0.441043
H  0.799536 -2.851829 -0.698295
H  1.228995 -2.293999 -2.333411
H  -1.169796 -2.44395 -2.211109
H  -0.778801 -0.721764 -2.309178
H  -2.510975 0.921032 -1.639721
H  -2.417741 2.058584 -0.286027
H  3.394205 -2.106503 -1.227066
H  2.973571 -2.037535 0.505568
H  -4.583639 -0.238623 -2.075476
H  4.666614 -0.224214 -2.314292
H  -3.910124 1.487034 1.852197
H  3.868883 -0.231042 1.952432
H  -6.920449 -0.844612 -1.410275
H  6.383213 1.569482 -1.996672
H  -6.242083 0.881969 2.52004
H  5.599884 1.553377 2.278492
H  -7.759563 -0.290043 0.89392
H  6.859378 2.465621 0.303484
