program: Gaussian 09
title: 000264885
version: EM64L-G09RevD.01
frameworkgroup: C1[X(C12H13ClN4O3S)]
method: RPBEPBE
basis: SDD
operation: Freq
keyword: #p
keyword: freq=noraman
keyword: PBEPBE/SDD
title: #p freq=noraman PBEPBE/SDD
converged: YES YES NO NO
title: Mulliken charges:
elementType: Cl S O O O N N N N C C C C C C C C C C C C H H H H H H H H H H H H H
charge: 0.038544 0.309295 -0.306288 -0.469982 -0.438058 -0.189649 -0.017947 -0.066916 0.126706 -0.056874 -0.077988 -0.158638 -0.201583 -0.174511 -0.351577 0.273037 -0.214591 0.090165 -0.324892 -0.398501 -0.859568 0.232770 0.207463 0.229395 0.244786 0.238824 0.230369 0.209663 0.274935 0.405657 0.351044 0.326372 0.265398 0.253138
chargesum: 0.00000
title: Mulliken charges with hydrogens summed into heavy atoms:
elementType: Cl S O O O N N N N C C C C C C C C C C C C
charge: 0.038544 0.309295 -0.306288 -0.064325 -0.087014 -0.189649 -0.017947 -0.066916 0.126706 0.175896 0.129475 0.070757 0.043204 0.064314 0.088456 0.273037 0.060344 0.090165 -0.324892 -0.398501 -0.014660
polarizability: 2.29172538e+02 1.73951649e+01 2.38942251e+02 -1.88771672e+01 1.10258579e+01 1.25150609e+02
1716.lowfreq: -2.5684 -0.0010 0.0008 0.0016 5.6201 7.0753 33.7325 36.3084 63.4978
frequency: 33.7127 36.2873 63.4967 80.9244 87.7179 107.8421 120.4090 127.2316 147.4215 158.4610 170.2530 172.0031 194.9382 238.9487 250.3230 265.6881 290.3285 321.7716 323.3422 368.0701 383.2005 406.0929 414.8555 438.9897 460.7780 493.8179 530.9495 550.2458 578.9960 605.1982 643.6682 661.2072 669.5983 675.5226 718.2084 742.4774 764.2083 782.7143 810.9272 817.4605 831.8664 836.3367 839.6139 886.9574 900.3404 946.1073 965.7066 976.7675 978.4621 980.9872 1013.3364 1022.0008 1037.7465 1073.9485 1089.2457 1099.8300 1155.2289 1178.0672 1186.4703 1196.8781 1205.3684 1246.7771 1259.4811 1280.9584 1290.8019 1296.3941 1310.4397 1322.0343 1323.1591 1333.3058 1346.4982 1362.6200 1371.9506 1383.9659 1402.9523 1439.5466 1449.5448 1459.8927 1462.3865 1486.1509 1496.9315 1563.8962 1667.2769 2946.9101 2981.0545 2993.4139 3007.6356 3016.3970 3045.1782 3087.0699 3126.5430 3138.7781 3152.6834 3156.9779 3228.9432 3555.4144
redmass: 8.1498 7.3164 4.2966 4.2389 6.2901 3.8093 3.8188 4.3201 6.8262 3.3173 3.9807 4.6726 3.0070 5.6495 3.8213 5.7864 4.2183 5.0727 6.0782 5.5147 10.4659 3.4315 5.4975 1.5886 3.5949 4.2622 6.6667 4.9542 9.1869 9.7816 4.5078 7.6219 6.5113 5.0046 2.4126 6.6924 3.7632 4.7979 3.5270 1.4395 1.7577 3.8362 4.4934 2.9393 7.8818 3.5596 4.9809 1.3172 1.9087 1.2252 1.3236 3.4755 3.4656 2.8277 5.4122 2.0090 5.7655 1.8983 1.3861 1.3255 6.4888 1.3127 3.1286 1.2419 2.2444 1.6875 1.4965 1.3112 4.5932 1.8568 1.3426 1.1968 1.6877 1.2999 5.0367 1.0834 3.9218 1.0809 1.0858 1.4705 2.8978 9.4232 6.9950 1.0834 1.0838 1.0765 1.0620 1.0290 1.0847 1.1027 1.0859 1.1035 1.1065 1.1011 1.0987 1.0655
irintensity: 1.1030 0.5823 3.0163 2.9611 4.1982 0.2679 0.3846 4.7450 0.9720 0.3939 1.0519 1.5978 4.9745 1.6317 3.8082 8.4922 4.7135 1.6039 1.9610 3.6613 5.6686 16.2656 13.9735 119.6097 6.5802 7.6729 3.6265 15.8841 5.2728 14.2842 10.3562 2.3418 5.9843 5.2132 9.4699 23.6565 0.4736 0.2367 176.0404 86.7327 13.1636 37.5337 15.4149 55.9391 75.2335 9.5649 86.1000 1.5622 22.8161 6.7715 25.7535 46.3538 155.2803 9.0826 73.9620 28.8838 114.5281 76.8335 8.6274 17.0212 38.6159 13.0410 37.7330 6.2173 28.8738 44.7225 3.2167 25.0161 145.8814 39.9215 5.2987 6.4341 24.0956 20.6592 64.8405 26.2149 115.2149 72.7537 4.7667 162.6955 127.0188 190.7263 1.4681 38.2531 25.1582 828.7510 28.4055 24.9550 7.6643 25.3747 1.9379 10.0879 11.0114 15.9654 0.8784 6.0454
temp: 298.150 k
press: 1.00000 atm
elementType: 17 16 8 8 8 7 7 7 7 6 6 6 6 6 6 6 6 6 6 6 6 1 1 1 1 1 1 1 1 1 1 1 1 1
symmnumber: 1
zpe: 646602.6 jmol-1
zpe.correction: 0.246278 hartree
zpe.thermalcorrener: 0.265772 hartree
zpe.thermalcorrenthalpy: 0.266717 hartree
zpe.thermalcorrgfe: 0.197618 hartree
zpe.sumelectzpe: -1766.274005 hartree
zpe.sumelectthermal: -1766.254511 hartree
zpe.sumelectthermalent: -1766.253567 hartree
zpe.sumelectthermalfe: -1766.322665 hartree
dipole: 4.2584 0.1875 -5.5402
dipole: 6.9902
quadrupole: -156.7624 -131.8323 -136.1713
quadrupole: 1.2918 -12.1267 1.5902
quadrupole: -15.1737 9.7564 5.4173 1.2918 -12.1267 1.5902
hfenergy: -1766.5202831 hartree
pointgroup: C01 [X(C12H13Cl1N4O3S1)]
dipole: -1.5377638 0.0479639 2.2795433 debye
polarizability: 225.417377|-16.7863729|240.5189823|-25.8555208|-5.5454707|127.3290382 unknown
InChI: InChI=1S/C12H13ClN4O3S/c1-21-12-15-10(13)9-11(16-12)17(5-14-9)8-3-2-6(19)7(4-18)20-8/h2-3,5-8,18-19H,4H2,1H3
charge 0 multiplicity 1
34 atoms
Cl 4.773169 -1.242992 -1.108583
S  2.011022 3.249747 -0.48713
O  -2.027324 -1.053118 -0.272048
O  -1.785724 1.927999 -0.21315
O  -3.974527 -1.193283 -2.295305
N  0.064048 -1.52387 0.668165
N  2.009911 -2.642544 0.151275
N  0.791505 0.802837 0.092964
N  3.103269 0.846884 -0.698251
C  -3.198891 -0.128003 -0.204636
C  -1.370109 -1.371686 0.993654
C  -2.791305 1.163242 0.532431
C  -1.588115 -0.358756 2.104655
C  -2.257521 0.803824 1.910774
C  -3.596824 0.07638 -1.669344
C  0.963099 -0.544673 0.229514
C  0.7503 -2.755223 0.587164
C  2.16708 -1.267694 -0.083444
C  3.223208 -0.476972 -0.590101
C  1.922025 1.45058 -0.336016
C  0.536559 3.858763 0.513591
H  -4.025085 -0.629567 0.341784
H  -1.699313 -2.376753 1.337285
H  -3.671056 1.827301 0.606954
H  -1.154976 -0.627863 3.075352
H  -2.372807 1.527062 2.725526
H  -2.767668 0.575361 -2.206817
H  -4.495995 0.712795 -1.725843
H  0.267838 -3.691826 0.861392
H  -0.871548 1.4887 -0.101477
H  -3.199536 -1.805778 -2.207808
H  -0.412788 3.666224 -0.003119
H  0.537784 3.372785 1.50079
H  0.715293 4.939918 0.623304
