program: Gaussian 09
title: 000264857
version: EM64L-G09RevD.01
frameworkgroup: C1[X(C18H20N2O)]
method: RPBEPBE
basis: SDD
operation: Freq
keyword: #p
keyword: freq=noraman
keyword: PBEPBE/SDD
title: #p freq=noraman PBEPBE/SDD
converged: YES YES NO NO
title: Mulliken charges:
elementType: O N N C C C C C C C C C C C C C C C C C C H H H H H H H H H H H H H H H H H H H H
charge: -0.278902 -0.154969 -0.374979 -0.177195 -0.465718 0.357705 -0.419096 0.216793 -0.457385 -0.423578 -0.381714 -0.647869 -0.275823 -0.245415 0.162353 0.262064 -0.351020 -0.358058 -0.222469 -0.237300 -0.227305 0.275155 0.195267 0.235392 0.212683 0.199486 0.228964 0.274759 0.250439 0.229739 0.223003 0.216351 0.235577 0.298660 0.223575 0.217615 0.275272 0.214260 0.232468 0.228824 0.232392
chargesum: 0.00000
title: Mulliken charges with hydrogens summed into heavy atoms:
elementType: O N N C C C C C C C C C C C C C C C C C C
charge: -0.278902 -0.154969 -0.076320 0.097960 -0.035059 0.357705 -0.006928 0.216793 0.046338 -0.173139 -0.151975 0.027062 -0.052248 -0.027800 0.162353 0.262064 -0.075749 -0.143798 0.009999 -0.008477 0.005087
polarizability: 2.91510022e+02 1.49305351e+01 2.17624021e+02 1.90175083e+01 -1.43688481e+01 1.24202352e+02
1716.lowfreq: -6.3700 -4.0306 0.0006 0.0006 0.0011 3.1061 18.9442 24.9018 30.4427
frequency: 18.3101 24.8800 30.3397 50.1849 64.5451 91.4761 109.9109 142.4035 157.4310 176.8864 197.1618 228.4766 287.8816 303.5205 315.5495 319.3522 364.2719 398.6334 404.1331 417.5840 432.7986 464.1143 488.6679 494.5285 516.5855 518.7783 555.1316 581.9713 614.5386 634.6915 663.3813 686.7139 696.7886 703.1176 739.4363 753.8428 778.6640 791.8707 815.6897 841.3835 853.3109 855.1531 877.6004 932.8903 933.8415 954.7387 968.9895 979.6481 982.9167 989.0919 1003.7611 1005.4015 1012.0190 1032.6484 1042.9348 1079.8257 1082.8717 1095.3594 1102.3928 1112.6383 1135.9253 1141.6031 1173.1061 1175.0680 1189.2024 1190.7434 1207.8991 1218.9900 1234.9424 1254.7905 1272.3002 1276.5672 1312.3025 1315.2414 1322.2934 1337.8379 1356.0350 1362.6012 1382.3776 1384.2088 1386.5505 1430.8406 1440.0102 1444.5579 1453.9721 1461.2701 1468.8084 1468.9656 1479.6123 1495.1500 1498.7665 1513.8049 1570.0926 1580.2588 1604.1648 1610.8674 1617.8400 2882.3533 2924.7318 2992.5929 3006.7046 3009.3630 3017.6048 3027.4361 3054.7795 3082.9106 3084.4461 3110.4329 3116.6217 3125.2318 3131.3532 3144.2872 3153.2630 3157.3111 3166.2235 3169.1923 3567.4428
redmass: 4.4802 3.8568 5.2389 4.5653 4.8819 4.0870 3.4331 3.4302 4.5624 1.9535 2.1671 2.7083 3.3523 2.4389 3.4382 3.1391 2.7513 3.5976 3.4241 4.1187 3.3282 3.6906 4.2615 2.7952 1.3761 3.5514 3.3989 3.4178 6.3391 3.2742 5.4286 4.6907 3.2260 1.6481 2.2701 1.6937 3.0306 2.3900 3.7736 1.4966 1.8537 1.6289 2.4862 1.4823 1.4533 1.8224 1.3371 2.3129 1.4086 5.5504 2.7748 1.4938 2.9038 2.1505 2.3744 2.0885 1.7169 1.7384 1.6028 1.6301 1.6203 2.9926 1.0581 1.0970 1.1534 1.4608 1.4175 1.7311 1.7260 1.4753 2.0815 2.0635 1.3144 1.3324 1.5597 1.5874 1.4119 1.3445 2.1078 9.1157 3.6680 2.0532 1.5190 1.2640 1.5738 1.1582 1.2215 1.4298 1.2835 2.1280 1.1821 1.8675 6.3684 6.9419 6.6983 6.1067 6.2072 1.0712 1.0466 1.0633 1.0699 1.0899 1.0734 1.0875 1.1020 1.1029 1.0963 1.0885 1.0870 1.0877 1.0871 1.0920 1.0933 1.0956 1.0978 1.1006 1.0776
irintensity: 0.1242 0.2917 0.6028 4.3669 4.1969 0.7042 4.2044 6.6549 1.0234 0.5213 1.4617 6.0550 0.2511 2.7951 7.9407 1.6369 0.5052 1.8266 1.3200 11.4435 2.0606 2.9495 1.9690 3.9336 108.4207 7.1577 7.8651 4.7666 1.1536 1.7155 4.8424 8.4010 4.8449 91.8396 17.3959 81.1574 1.1031 20.9168 8.8484 3.7387 3.0311 4.2947 2.7759 1.8021 3.2093 8.3156 0.8690 8.0110 1.4753 1.2165 7.3089 1.6635 13.8500 7.9288 19.8394 2.6701 22.3204 6.0216 3.8698 5.0266 6.4426 18.6290 1.1435 0.8821 15.0526 7.2153 20.2955 3.5219 20.3959 23.8730 140.0764 33.4234 8.2617 2.2077 78.0029 34.6885 1.0179 6.6334 2.4616 1.3594 14.8461 14.4934 21.9414 42.8653 11.9019 14.0315 60.9062 64.3691 50.4658 173.7985 5.9329 131.1592 72.6417 12.5320 40.9105 4.0520 88.2104 107.8938 118.8865 25.9804 2.3986 44.1759 43.3347 59.2907 37.8841 5.0039 28.0995 7.9634 12.1299 13.0670 2.0698 23.3047 30.3053 17.1241 28.0950 21.8673 9.9500
temp: 298.150 k
press: 1.00000 atm
elementType: 8 7 7 6 6 6 6 6 6 6 6 6 6 6 6 6 6 6 6 6 6 1 1 1 1 1 1 1 1 1 1 1 1 1 1 1 1 1 1 1 1
symmnumber: 1
zpe: 894014.2 jmol-1
zpe.correction: 0.340512 hartree
zpe.thermalcorrener: 0.359168 hartree
zpe.thermalcorrenthalpy: 0.360112 hartree
zpe.thermalcorrgfe: 0.291236 hartree
zpe.sumelectzpe: -881.142834 hartree
zpe.sumelectthermal: -881.124178 hartree
zpe.sumelectthermalent: -881.123234 hartree
zpe.sumelectthermalfe: -881.192110 hartree
dipole: 0.9701 5.6258 -0.6304
dipole: 5.7435
quadrupole: -106.1510 -119.2330 -126.4386
quadrupole: -0.4218 2.7600 -4.1042
quadrupole: 11.1232 -1.9588 -9.1644 -0.4218 2.7600 -4.1042
hfenergy: -881.4833463 hartree
pointgroup: C01 [X(C18H20N2O1)]
dipole: 0.4585094 -2.1899744 0.3160027 debye
polarizability: 292.3818332|-12.953628|215.6484613|-18.4374752|-17.8625921|125.3061007 unknown
InChI: InChI=1S/C18H20N2O/c1-20-12-11-15(16-9-5-6-10-17(16)20)13-19-18(21)14-7-3-2-4-8-14/h2-10,15,19H,11-13H2,1H3
charge 0 multiplicity 1
41 atoms
O  1.715512 1.846438 -0.108942
N  -3.400016 -1.792377 -0.197216
N  1.24782 -0.273666 0.711241
C  -1.009155 -0.074187 -0.433185
C  -1.06712 -1.513378 -0.99126
C  -2.415957 0.476645 -0.213821
C  -2.050479 -2.382216 -0.183302
C  -3.549523 -0.397196 -0.083245
C  -0.182829 0.024534 0.890991
C  -2.607202 1.873631 -0.129176
C  -4.834009 0.185194 0.146531
C  -4.543117 -2.678032 0.035835
C  -3.880563 2.443778 0.090878
C  -4.992511 1.583034 0.230145
C  2.122412 0.686541 0.225113
C  3.572846 0.287292 0.105432
C  4.390292 1.056855 -0.761225
C  4.152645 -0.786996 0.830794
C  5.75603 0.744651 -0.921024
C  5.521867 -1.096716 0.674339
C  6.325313 -0.336569 -0.206992
H  -0.487205 0.576575 -1.159818
H  -0.061329 -1.975746 -0.97742
H  -1.403617 -1.487326 -2.044321
H  -2.108903 -3.392919 -0.628075
H  -1.677881 -2.509949 0.861479
H  -0.59292 -0.659271 1.65703
H  -0.266131 1.055758 1.273739
H  -1.731205 2.524814 -0.249075
H  -5.714148 -0.453169 0.265361
H  -4.926024 -2.627651 1.079106
H  -4.240508 -3.719099 -0.166763
H  -5.381598 -2.433812 -0.644332
H  1.582368 -1.223366 0.871399
H  -4.001276 3.530221 0.150694
H  -5.991953 1.998067 0.406562
H  3.929856 1.89814 -1.289557
H  3.559744 -1.363422 1.551812
H  6.377175 1.342522 -1.5969
H  5.963427 -1.920283 1.246256
H  7.387172 -0.578249 -0.327685
