program: Gaussian 09
title: 000264856
version: EM64L-G09RevD.01
frameworkgroup: C1[X(C18H18O)]
method: RPBEPBE
basis: SDD
operation: Freq
keyword: #pfreq=noraman
keyword: PBEPBE/SDD
title: #p freq=noraman PBEPBE/SDD
converged: YES YES NO NO
title: Mulliken charges:
elementType: O C C C C C C C C C C C C C C C C C C H H H H H H H H H H H H H H H H H H
charge: -0.256666 0.194409 0.330851 0.368987 0.481582 -0.627686 -0.619027 -0.237414 -0.852580 -0.865606 -0.813292 -0.331656 0.073522 0.284922 -0.345164 -0.351769 -0.252402 -0.235621 -0.230334 0.238350 0.235709 0.268250 0.233310 0.245941 0.240628 0.238304 0.230124 0.245009 0.238510 0.226775 0.227605 0.227482 0.218388 0.280570 0.227781 0.231002 0.231207
chargesum: 0.00000
title: Mulliken charges with hydrogens summed into heavy atoms:
elementType: O C C C C C C C C C C C C C C C C C C
charge: -0.256666 0.194409 0.330851 0.368987 0.481582 -0.389336 -0.383318 0.030836 -0.132702 -0.152169 -0.120402 -0.104174 0.073522 0.284922 -0.126775 -0.071199 -0.024621 -0.004619 0.000873
polarizability: 4.02441054e+02 -1.32354949e+00 2.08217018e+02 1.71709045e+00 -1.94712590e+00 9.18050173e+01
1716.lowfreq: -18.6889 -10.4615 -0.0010 -0.0008 -0.0005 3.6860 4.3004 5.9672 13.3795
frequency: -18.1024 -6.4003 12.9581 47.6746 52.8330 83.2785 149.2308 167.2727 177.4742 181.7510 199.9735 205.4733 224.6966 276.2763 300.8171 303.7870 325.8673 374.4397 399.2177 402.3940 444.3450 463.7246 490.8260 516.7594 529.9851 559.8129 564.8357 584.1019 614.2982 649.2278 675.9380 695.1282 748.6453 753.1089 796.4364 852.0301 861.2166 867.3792 881.5832 900.0211 936.7218 940.7012 963.8900 988.5603 989.1940 1010.6484 1012.1226 1014.9340 1015.5465 1021.1414 1035.2238 1040.5861 1043.3118 1043.7402 1049.3476 1086.3420 1161.7861 1171.9366 1187.6424 1215.7830 1224.3522 1268.3818 1301.1434 1309.5921 1323.7969 1346.0696 1375.8860 1385.8479 1395.3872 1397.4263 1401.5811 1420.5327 1432.8054 1445.9037 1471.3677 1472.5505 1474.1653 1476.0294 1479.5607 1488.2124 1494.6249 1513.5808 1565.1370 1586.9676 1607.7683 1616.1101 1626.9569 2968.8537 2973.9264 2980.4283 3048.2007 3055.3794 3059.1135 3082.4959 3086.2628 3086.6031 3106.5479 3115.1390 3121.7133 3126.3954 3136.5749 3148.9197 3158.2665 3168.3787 3216.4736
redmass: 1.0178 4.0028 3.9205 4.2959 4.3273 2.8919 3.2101 3.3937 2.8904 2.2491 5.2628 2.3326 1.7405 2.6507 1.2181 4.7580 2.7192 2.9746 3.3531 4.2060 3.5979 3.8708 5.9897 4.5358 3.0443 3.8659 3.1409 3.9428 6.4193 6.6807 3.6981 1.5766 3.0366 4.3258 2.2795 1.3686 2.9218 1.4596 1.8310 1.3021 2.5811 1.4699 3.4858 1.4665 4.8431 1.3153 2.4535 1.3391 1.6232 1.8339 1.7634 1.5693 1.6678 1.8121 1.6513 1.6371 2.3656 1.0665 1.1412 2.1361 1.6841 1.6651 1.7778 3.7665 1.8704 1.7485 2.3304 8.4866 1.2247 1.2868 1.2932 2.3087 2.3167 2.3971 1.1306 1.0660 1.0557 1.0486 2.2166 1.1590 1.3190 6.9832 6.2976 6.0562 5.8865 5.6504 5.4001 1.0383 1.0390 1.0379 1.0963 1.0942 1.0970 1.0982 1.0999 1.0987 1.0859 1.0910 1.0917 1.0848 1.0881 1.0925 1.0957 1.1009 1.0888
irintensity: 0.4771 0.8870 0.9307 0.2385 1.1225 1.3395 1.6677 3.8682 3.4074 0.3126 0.2140 0.1082 0.0674 2.0754 1.3109 8.3387 0.2581 2.0147 0.0178 0.4077 1.9391 8.3461 14.9402 0.5881 0.8564 1.5254 4.4145 1.6678 0.3928 32.4953 5.6897 57.5764 27.7343 16.4247 25.7346 5.7816 2.7289 22.7163 1.1688 0.0680 5.3685 0.8875 0.1492 1.7713 1.5110 5.5292 53.8595 22.7027 4.8924 23.5901 10.8501 9.0120 8.1321 16.3552 29.7200 10.7447 24.4080 6.2074 45.4550 102.4876 83.4105 26.5639 89.1306 2.0728 220.4419 16.6852 80.5420 1.1800 16.0134 5.7049 28.2365 2.5244 3.1132 1.0349 14.8068 6.8070 18.0221 13.4647 0.7517 44.1804 2.0760 295.4965 33.4155 56.1450 101.1728 224.7146 102.0689 19.1270 37.0553 19.0957 17.0098 22.7482 15.1331 21.7552 10.4788 29.1135 0.4358 28.3138 32.7323 1.0387 7.9703 27.6390 19.8861 31.6740 8.2368
temp: 298.150 k
press: 1.00000 atm
elementType: 8 6 6 6 6 6 6 6 6 6 6 6 6 6 6 6 6 6 6 1 1 1 1 1 1 1 1 1 1 1 1 1 1 1 1 1 1
symmnumber: 1
zpe: 794352.6 jmol-1
zpe.correction: 0.302553 hartree
zpe.thermalcorrener: 0.319061 hartree
zpe.thermalcorrenthalpy: 0.320005 hartree
zpe.thermalcorrgfe: 0.257269 hartree
zpe.sumelectzpe: -770.592332 hartree
zpe.sumelectthermal: -770.575823 hartree
zpe.sumelectthermalent: -770.574879 hartree
zpe.sumelectthermalfe: -770.637616 hartree
dipole: 1.8754 -3.1359 0.5489
dipole: 3.6949
quadrupole: -87.1853 -106.6130 -118.9124
quadrupole: 6.5112 -0.3982 0.9109
quadrupole: 17.0516 -2.3761 -14.6755 6.5112 -0.3982 0.9109
hfenergy: -770.8948846 hartree
pointgroup: C01 [X(C18H18O1)]
dipole: 0.7866042 0.3315575 -1.1766556 debye
polarizability: 401.6332463|-14.8366781|115.3533694|1.1425217|-46.3585005|185.4764733 unknown
InChI: InChI=1S/C18H18O/c1-13-11-14(2)17(15(3)12-13)9-10-18(19)16-7-5-4-6-8-16/h4-12H,1-3H3
charge 0 multiplicity 1
37 atoms
O  -1.922275 -0.698084 1.983729
C  1.96025 -0.231799 0.255229
C  2.949976 -0.850512 1.10783
C  2.409695 0.448222 -0.93388
C  4.761957 -0.142717 -0.418386
C  4.314425 -0.798942 0.75367
C  3.790191 0.481483 -1.235685
C  0.563773 -0.324819 0.690564
C  2.5696 -1.577338 2.390334
C  1.469407 1.167786 -1.884177
C  6.231491 -0.124248 -0.794079
C  -0.626421 -0.064717 0.050104
C  -1.9055 -0.276547 0.77677
C  -3.21095 0.009124 0.07478
C  -3.303112 0.570684 -1.228284
C  -4.41236 -0.295737 0.772299
C  -4.562964 0.818022 -1.816014
C  -5.669132 -0.052129 0.186052
C  -5.749403 0.506593 -1.112923
H  5.050808 -1.279805 1.409379
H  4.117702 1.01353 -2.137897
H  0.414787 -0.687727 1.717364
H  3.466623 -2.00318 2.870038
H  1.86229 -2.40637 2.205924
H  2.090744 -0.90231 3.124492
H  2.041928 1.763374 -2.615232
H  0.844831 0.455857 -2.457873
H  0.785552 1.851373 -1.348126
H  6.489938 -1.00177 -1.418961
H  6.491175 0.778246 -1.374758
H  6.879244 -0.157892 0.099504
H  -0.672698 0.259204 -0.987822
H  -2.40192 0.82867 -1.793348
H  -4.321924 -0.722041 1.776848
H  -4.619576 1.253843 -2.819667
H  -6.585423 -0.294522 0.73562
H  -6.72623 0.698196 -1.571211
