program: Gaussian 09
title: 000264867
version: EM64L-G09RevD.01
frameworkgroup: C1[X(C21H18O2)]
method: RPBEPBE
basis: SDD
operation: Freq
keyword: #pfreq=noraman
keyword: PBEPBE/SDD
title: #p freq=noraman PBEPBE/SDD
converged: YES YES NO NO
title: Mulliken charges:
elementType: O O C C C C C C C C C C C C C C C C C C C C C H H H H H H H H H H H H H H H H H H
charge: -0.425153 -0.369035 0.376733 -0.716939 0.384030 -0.715119 0.003888 -0.017785 0.500383 0.472551 -0.278823 -0.326652 -0.218698 -0.445083 -0.370762 -0.379160 -0.417157 -0.221723 -0.225279 -0.228814 -0.225743 -0.244338 -0.243276 0.272642 0.218163 0.210045 0.263311 0.224799 0.214669 0.211769 0.226151 0.253357 0.279192 0.219536 0.224690 0.225749 0.224128 0.222461 0.228380 0.226573 0.386337
chargesum: 0.00000
title: Mulliken charges with hydrogens summed into heavy atoms:
elementType: O O C C C C C C C C C C C C C C C C C C C C C
charge: -0.038816 -0.369035 0.376733 -0.226134 0.384030 -0.241763 0.003888 -0.017785 0.500383 0.472551 -0.054023 -0.111983 -0.006930 -0.218931 -0.117405 -0.099968 -0.197621 0.002968 0.000470 -0.004685 -0.003281 -0.015958 -0.016703
polarizability: 2.83388998e+02 -6.41361685e+00 2.00469441e+02 1.08457232e+01 -1.13956785e+01 2.22156072e+02
1716.lowfreq: -6.7799 0.0006 0.0008 0.0010 2.7694 8.6156 12.8345 13.7717 25.8600
frequency: 11.5826 13.5350 25.8059 35.6311 46.7559 56.2146 93.4965 122.1745 182.8307 187.3417 204.4080 230.2743 247.2648 275.2775 341.4765 361.1362 396.6057 404.2438 404.4477 413.0242 429.1300 453.2900 468.7955 473.3548 488.8864 544.6564 559.9473 590.8551 607.4846 617.0633 618.8120 645.9063 682.3590 705.5646 708.2755 734.9285 754.8768 760.0492 775.5350 813.1781 817.8649 832.7240 854.4170 857.1565 895.3634 897.4192 900.1368 927.9263 928.7128 953.6701 957.6342 977.7346 980.7072 989.0771 989.7325 996.0966 997.8456 999.3903 1026.2402 1026.6284 1034.1485 1080.5871 1087.5318 1091.4974 1158.8714 1171.1645 1171.9945 1186.4232 1187.4350 1189.6699 1192.7397 1201.1786 1203.5422 1235.4226 1250.0252 1289.2150 1297.1671 1304.9199 1328.7278 1330.2579 1350.7722 1379.0025 1381.5052 1393.7564 1439.5801 1440.5946 1441.6442 1464.3706 1472.0065 1481.0237 1483.6360 1518.6090 1538.3074 1591.4074 1592.2102 1597.1898 1608.4497 1610.7370 1613.4443 2876.9396 3006.2584 3008.9461 3074.4988 3078.7257 3092.4215 3102.8525 3109.8023 3112.4420 3123.4454 3124.0074 3131.4460 3135.3731 3135.9612 3145.9405 3148.2866 3161.6703 3163.0264
redmass: 4.1530 4.7573 5.0375 4.5975 4.5004 5.4961 5.8761 9.9864 4.1807 4.8212 4.6885 5.0436 4.6198 5.5733 3.0109 3.1193 2.7225 2.8262 2.8536 4.9567 3.3729 5.0871 3.4317 4.5895 3.9219 4.9116 4.2603 5.5048 4.9650 6.2533 6.1981 5.0454 3.7701 1.8921 1.6685 4.4089 2.1745 2.4436 1.6632 3.7698 4.4367 2.5762 1.2471 1.2524 1.8239 1.4604 1.5067 1.6190 1.4784 1.4653 2.4568 1.3847 1.3756 5.8900 6.0052 1.3247 1.3614 1.3316 2.3274 2.2525 2.5836 1.6016 1.6436 4.3388 1.3767 1.0593 1.0663 1.1324 1.2803 1.1744 2.2032 2.5843 2.5689 2.1475 1.8637 1.5185 1.3528 1.5142 1.2794 1.2798 2.3672 6.1803 8.0937 1.9405 2.1098 2.1533 1.7715 1.2324 1.2307 2.0627 1.8569 3.7999 5.2740 6.0462 6.0393 4.9295 6.2531 6.2279 6.1715 1.0607 1.0632 1.0598 1.1020 1.0983 1.0850 1.0879 1.0871 1.0874 1.0864 1.0860 1.0942 1.0914 1.0921 1.0961 1.0956 1.1014 1.1015
irintensity: 0.0912 0.3065 0.8190 1.2455 0.9334 0.1161 0.2315 1.4021 1.8843 0.5057 0.0156 1.5015 0.8127 0.9895 3.6087 0.3857 4.5586 0.1101 0.5887 21.8963 7.0073 0.6155 7.0897 3.0525 8.9388 6.6510 4.7169 0.5301 2.1850 0.2630 0.9392 60.7984 20.5153 67.2754 53.3275 26.6712 30.6569 23.4011 25.9303 1.0462 10.7951 10.8886 0.0883 1.1033 28.3167 55.2295 26.1708 6.5552 3.0735 0.4581 8.9095 0.0120 0.8042 0.1253 0.5367 0.1937 0.7182 1.4989 7.9543 10.3667 11.9430 3.9952 40.9648 3.4904 8.2533 0.2793 0.4029 2.5661 1.4225 5.8478 15.3102 4.1588 7.0157 54.5839 115.8366 48.8482 15.1112 44.9125 9.8043 2.4610 189.7818 4.5724 0.4253 22.1686 23.5029 12.0067 98.7062 18.4279 18.0684 25.0859 15.6735 73.8517 10.7237 1.3668 1.5041 2.3968 15.0941 9.9646 9.8084 132.4921 23.1723 28.6427 2.3308 3.0350 7.5516 12.6820 10.4622 9.6229 1.1531 0.3636 22.0433 14.0147 28.2121 35.2158 19.1303 27.7019 25.6351
temp: 298.150 k
press: 1.00000 atm
elementType: 8 8 6 6 6 6 6 6 6 6 6 6 6 6 6 6 6 6 6 6 6 6 6 1 1 1 1 1 1 1 1 1 1 1 1 1 1 1 1 1 1
symmnumber: 1
zpe: 857816.8 jmol-1
zpe.correction: 0.326725 hartree
zpe.thermalcorrener: 0.345959 hartree
zpe.thermalcorrenthalpy: 0.346903 hartree
zpe.thermalcorrgfe: 0.274836 hartree
zpe.sumelectzpe: -959.870932 hartree
zpe.sumelectthermal: -959.851699 hartree
zpe.sumelectthermalent: -959.850754 hartree
zpe.sumelectthermalfe: -959.922821 hartree
dipole: 1.0191 0.0500 3.6414
dipole: 3.7817
quadrupole: -131.7682 -127.6691 -127.8662
quadrupole: -1.8952 -0.2176 -8.3826
quadrupole: -2.6670 1.4320 1.2350 -1.8952 -0.2176 -8.3826
hfenergy: -960.1976574 hartree
pointgroup: C01 [X(C21H18O2)]
dipole: 0.4341254 -0.0232797 -1.422882 debye
polarizability: 283.1190927|10.1174444|200.8421033|-9.0955058|-11.315146|222.0533157 unknown
InChI: InChI=1S/C21H18O2/c22-20-18(14-16-8-3-1-4-9-16)12-7-13-19(21(20)23)15-17-10-5-2-6-11-17/h1-13,22H,14-15H2
charge 0 multiplicity 1
41 atoms
O  0.978849 1.403873 2.235173
O  -1.470107 1.318786 2.008915
C  1.589552 1.383841 -0.075089
C  3.053193 1.447309 0.381089
C  -1.682995 1.280362 -0.388577
C  -3.201732 1.241921 -0.191539
C  0.590025 1.368214 0.911892
C  -0.896722 1.317304 0.828094
C  3.773583 0.104782 0.233438
C  -3.74871 -0.189285 -0.147356
C  1.353925 1.320083 -1.480028
C  -1.184275 1.252399 -1.698722
C  0.150863 1.260262 -2.192431
C  4.831902 -0.05517 -0.695456
C  3.388403 -1.00733 1.027797
C  -3.612283 -0.97844 1.025176
C  -4.388334 -0.753819 -1.280114
C  5.493061 -1.298424 -0.832674
C  4.046516 -2.248793 0.892845
C  -4.101145 -2.303279 1.057675
C  -4.878264 -2.080015 -1.248448
C  5.100841 -2.40009 -0.039644
C  -4.733699 -2.860642 -0.078815
H  3.083816 1.774539 1.433304
H  3.578866 2.209704 -0.223902
H  -3.684061 1.792123 -1.019833
H  -3.439995 1.755097 0.755814
H  2.268029 1.314125 -2.090444
H  -1.95824 1.213465 -2.479034
H  0.245322 1.219454 -3.285152
H  5.147758 0.799213 -1.307908
H  2.5767 -0.891197 1.755634
H  -3.122691 -0.5412 1.902425
H  -4.513478 -0.150571 -2.188698
H  6.312208 -1.404827 -1.553124
H  3.740274 -3.097763 1.51472
H  -3.992169 -2.900108 1.970625
H  -5.375239 -2.499871 -2.130693
H  5.61144 -3.364098 -0.143486
H  -5.113925 -3.888141 -0.051326
H  0.071036 1.390704 2.734478
