program: Gaussian 09
title: 000264849
version: EM64L-G09RevD.01
frameworkgroup: C1[X(C17H12O2)]
method: RPBEPBE
basis: SDD
operation: Freq
keyword: #pfreq=noraman
keyword: PBEPBE/SDD
title: #p freq=noraman PBEPBE/SDD
converged: YES YES NO NO
title: Mulliken charges:
elementType: O O C C C C C C C C C C C C C C C C C H H H H H H H H H H H H
charge: -0.234375 -0.225654 0.238710 0.282021 0.313137 -0.488813 -0.031884 0.309083 -0.271025 -0.376153 -0.363946 -0.366723 -0.355827 -0.236927 -0.229500 -0.241119 -0.243680 -0.234512 -0.229080 0.279408 0.290237 0.226286 0.262439 0.264417 0.273173 0.228885 0.229843 0.232092 0.232198 0.233647 0.233645
chargesum: 0.00000
title: Mulliken charges with hydrogens summed into heavy atoms:
elementType: O O C C C C C C C C C C C C C C C C C
charge: -0.234375 -0.225654 0.238710 0.282021 0.313137 -0.209405 -0.031884 0.309083 0.019212 -0.149867 -0.101507 -0.102305 -0.082654 -0.008042 0.000343 -0.009028 -0.011483 -0.000865 0.004566
polarizability: 3.09165539e+02 3.95005844e+00 2.01069534e+02 -1.61084072e+01 7.04653126e-02 9.11242133e+01
1716.lowfreq: -0.0007 -0.0006 -0.0004 4.3466 6.1188 8.5775 28.8413 41.5974 49.9320
frequency: 28.8174 41.5924 49.9316 62.4903 97.3952 125.2948 149.8901 208.6261 225.0850 263.5650 296.4205 334.1148 400.1586 401.3651 406.2128 419.6584 473.8825 491.1748 550.6173 608.5189 614.3551 615.2443 655.0519 667.0695 685.1625 695.1364 701.7488 717.0741 772.1180 787.1243 814.1132 843.6111 853.3248 863.9919 871.6943 876.5696 926.1755 947.4505 980.3767 985.2483 987.2898 988.6287 991.7096 996.7639 999.4437 1005.2753 1028.1872 1032.0985 1082.7168 1084.5936 1108.5599 1159.4153 1174.3193 1174.8389 1183.3383 1190.9219 1194.9119 1256.4820 1282.7639 1317.2107 1325.7839 1355.7753 1383.8855 1385.2240 1433.5102 1438.8467 1469.6063 1477.8391 1522.2925 1536.5376 1577.5618 1587.8398 1592.0150 1608.8255 1619.9863 3127.5814 3128.4860 3135.7251 3138.6835 3148.1951 3150.0668 3159.3751 3160.9415 3169.4776 3172.4949 3232.3242 3267.3249
redmass: 3.9132 4.8281 5.6432 5.0745 4.7999 5.1801 5.9976 5.2053 5.0396 7.3631 6.1860 7.4979 2.8843 5.1675 3.0361 5.1077 4.6060 3.5659 5.1167 3.6883 6.4488 6.4577 3.8633 6.2445 5.6740 1.9188 2.3924 1.7264 1.7245 1.6947 2.0568 1.5988 1.3081 1.9000 2.8624 4.4664 1.4369 1.4341 1.3818 4.6475 3.7659 4.3289 1.8369 4.3302 1.3229 1.3535 2.0958 1.9536 1.6057 1.5792 4.6587 1.9870 1.0658 1.0768 1.2357 1.1835 1.1692 4.0847 2.6545 1.3676 1.4496 5.2273 7.9728 8.8534 2.2844 2.3992 2.3973 2.2517 5.7086 10.1841 6.0123 6.3167 7.0067 6.0532 6.1841 1.0850 1.0851 1.0880 1.0882 1.0936 1.0925 1.0961 1.0964 1.1012 1.1000 1.0977 1.1002
irintensity: 0.3881 0.3648 0.3409 0.5712 0.1238 0.1505 3.8444 0.9782 2.3001 1.2099 5.6039 1.0574 0.2050 3.2691 0.9026 0.9606 3.3257 4.4630 6.9588 2.2121 0.5098 0.1370 13.3322 11.6606 18.2621 31.5443 22.1132 125.8108 61.6416 19.6671 9.9583 26.7313 8.9486 13.8205 81.2946 24.6094 5.4505 2.7439 0.1536 9.8946 2.1515 1.5593 1.4218 6.0914 0.3647 1.1362 3.3221 8.2898 8.3152 8.9908 48.9054 11.8699 2.1131 0.5226 44.7312 0.5228 1.7760 76.8997 165.4437 1.2961 10.1364 15.4792 0.9835 3.1633 10.0644 10.1416 64.3802 0.9561 144.4764 160.3117 8.6708 7.3507 13.4144 21.7664 9.1510 4.3805 0.1541 2.3081 5.5953 28.1951 18.8805 19.4158 23.8588 22.1311 14.5223 2.9306 7.9918
temp: 298.150 k
press: 1.00000 atm
elementType: 8 8 6 6 6 6 6 6 6 6 6 6 6 6 6 6 6 6 6 1 1 1 1 1 1 1 1 1 1 1 1
symmnumber: 1
zpe: 622375.9 jmol-1
zpe.correction: 0.237050 hartree
zpe.thermalcorrener: 0.252042 hartree
zpe.thermalcorrenthalpy: 0.252986 hartree
zpe.thermalcorrgfe: 0.192879 hartree
zpe.sumelectzpe: -804.148906 hartree
zpe.sumelectthermal: -804.133915 hartree
zpe.sumelectthermalent: -804.132971 hartree
zpe.sumelectthermalfe: -804.193077 hartree
dipole: -1.0832 -3.6962 0.3983
dipole: 3.8722
quadrupole: -94.6473 -105.0334 -112.8900
quadrupole: -10.0095 -1.9020 1.9661
quadrupole: 9.5429 -0.8431 -8.6998 -10.0095 -1.9020 1.9661
hfenergy: -804.3859564 hartree
pointgroup: C01 [X(C17H12O2)]
dipole: -0.4337253 1.4104201 0.3788253 debye
polarizability: 308.5983481|-10.232885|186.26646|17.298744|37.3427529|106.4944785 unknown
InChI: InChI=1S/C17H12O2/c18-17(14-9-5-2-6-10-14)15-11-16(19-12-15)13-7-3-1-4-8-13/h1-12H
charge 0 multiplicity 1
31 atoms
O  -1.498576 -1.717624 -1.174795
O  2.651037 -2.498962 -0.654443
C  -1.549849 -0.553758 -0.351489
C  0.645063 -1.200353 -0.576144
C  -2.87032 0.011485 -0.080331
C  -0.251623 -0.221116 0.014905
C  2.118417 -1.359831 -0.45237
C  2.97475 -0.180745 -0.084515
C  -0.162518 -2.090335 -1.279669
C  -3.001367 1.162508 0.747075
C  -4.042815 -0.57386 -0.635079
C  2.61371 1.158478 -0.39369
C  4.22621 -0.435705 0.539006
C  -4.271732 1.711731 1.010479
C  -5.311132 -0.01923 -0.368022
C  -5.433997 1.125007 0.454592
C  3.485679 2.222043 -0.073745
C  5.087665 0.627682 0.872512
C  4.718566 1.960992 0.568124
H  0.037634 0.598134 0.668908
H  0.05856 -2.975373 -1.868603
H  -2.110267 1.625969 1.185104
H  -3.948548 -1.459569 -1.270554
H  1.674813 1.3649 -0.917841
H  4.500634 -1.475737 0.744588
H  -4.357132 2.597209 1.649925
H  -6.205232 -0.480414 -0.801738
H  -6.420563 1.553947 0.660804
H  3.208508 3.250314 -0.330822
H  6.04541 0.423166 1.363258
H  5.390914 2.788344 0.82157
