program: Gaussian 09
title: 000264850
version: EM64L-G09RevD.01
frameworkgroup: C1[X(C17H13BrO)]
method: RPBEPBE
basis: SDD
operation: Freq
keyword: #p
keyword: freq=noraman
keyword: PBEPBE/SDD
title: #p freq=noraman PBEPBE/SDD
converged: YES YES NO NO
title: Mulliken charges:
elementType: Br O C C C C C C C C C C C C C C C C C H H H H H H H H H H H H H
charge: 0.019987 -0.254091 0.310134 0.481897 -0.330856 -0.346361 0.096894 -0.305726 -0.381880 -0.389165 -0.200652 -0.193502 -0.323255 -0.212169 -0.211736 -0.156220 -0.235750 -0.236071 -0.235989 0.226575 0.287443 0.229443 0.225919 0.233546 0.252206 0.254808 0.209090 0.222019 0.266947 0.230051 0.232220 0.234246
chargesum: 0.00000
title: Mulliken charges with hydrogens summed into heavy atoms:
elementType: Br O C C C C C C C C C C C C C C C C C
charge: 0.019987 -0.254091 0.310134 0.481897 -0.104281 -0.058919 0.096894 -0.076283 -0.155960 -0.155619 0.051553 0.061306 -0.114165 0.009849 -0.211736 0.110727 -0.005698 -0.003852 -0.001743
polarizability: 5.84596060e+02 1.46277731e+01 1.97678911e+02 3.53071498e-01 -5.41301364e-02 7.38367666e+01
1716.lowfreq: -4.2663 -3.1581 -0.0007 0.0004 0.0004 3.3950 13.9339 20.2297 27.4752
frequency: 13.7294 20.2203 27.4234 55.6897 67.5509 96.6584 102.5766 146.6679 185.1929 185.8766 228.5852 262.7314 280.2250 295.8431 328.8494 347.6154 402.6164 404.4006 437.9058 473.2150 475.7328 509.0486 515.9492 612.7010 615.7602 621.1840 668.6722 687.4872 692.8405 734.7064 769.4436 822.0043 826.7614 839.0945 841.9555 848.0183 869.7694 903.1731 929.3955 955.2415 962.0265 980.5347 987.5155 991.9900 998.9451 1001.2909 1023.9835 1025.5004 1030.6430 1059.4459 1083.4430 1110.9299 1172.2174 1175.7181 1186.2203 1191.9259 1208.2863 1234.5549 1260.9430 1280.6498 1299.7574 1308.4143 1330.9044 1349.7596 1368.9216 1389.0786 1393.1191 1441.3616 1469.3738 1484.1338 1506.5410 1573.4552 1578.3903 1588.6182 1603.1969 1610.5244 1631.5691 3088.6488 3095.8796 3108.4606 3122.7664 3129.8053 3137.1720 3141.9993 3152.9824 3153.7666 3155.1138 3168.1875 3172.2141 3176.3231
redmass: 3.5485 4.8432 7.3894 6.1033 4.9202 4.3486 6.0416 9.0974 3.5374 6.0846 3.0759 9.7907 4.1629 5.1670 3.0437 5.4239 2.7709 2.8345 6.1007 5.8900 3.4101 2.7737 4.4459 5.8296 6.2409 7.1311 3.7615 6.8426 1.7083 2.6303 1.7807 5.1859 1.3800 5.0207 1.4387 1.3054 1.8473 1.6002 1.6424 1.3239 1.3333 1.3954 6.1607 5.0956 1.3316 1.3608 1.1396 2.3253 3.1823 2.5220 1.6533 1.4038 1.8398 1.2684 1.1531 1.1215 1.3251 2.3534 1.8312 1.4655 1.5162 1.4742 1.4668 1.7949 4.2694 5.5242 3.8425 2.3230 2.3474 2.2978 9.6434 7.4187 5.5827 6.0052 5.6645 5.5583 5.3545 1.0915 1.0908 1.0882 1.0873 1.0861 1.0899 1.0912 1.0962 1.0885 1.0872 1.1016 1.0961 1.0971
irintensity: 0.0090 0.0226 0.0316 0.0141 2.6719 0.1656 0.2567 0.9067 0.8427 1.7105 2.6657 1.3922 0.1265 5.2556 0.1358 37.2619 0.0031 0.0035 0.1648 22.8960 18.2860 7.1545 1.7260 4.7748 0.6488 3.6473 12.6148 3.6742 53.9242 21.6364 31.4333 37.3685 20.8090 28.5519 31.8704 24.3202 3.7528 5.2188 0.3234 4.8991 5.1302 0.1612 0.9611 147.9999 1.1212 0.8634 90.9416 24.7236 70.6269 79.4655 8.5435 23.5116 89.0558 35.2575 43.4004 3.5243 22.4358 32.8002 175.0449 57.0042 69.8392 54.1640 82.0969 113.4900 71.2525 2.6973 34.6416 16.5635 22.4645 1.0052 304.2307 95.3929 0.6257 320.0973 111.9554 25.6227 341.3880 4.1232 6.0579 19.1038 8.0314 1.4426 8.6283 5.0690 37.3086 0.8088 10.8438 42.5007 12.8784 4.2978
temp: 298.150 k
press: 1.00000 atm
elementType: 35 8 6 6 6 6 6 6 6 6 6 6 6 6 6 6 6 6 6 1 1 1 1 1 1 1 1 1 1 1 1 1
symmnumber: 1
zpe: 638804.2 jmol-1
zpe.correction: 0.243308 hartree
zpe.thermalcorrener: 0.260351 hartree
zpe.thermalcorrenthalpy: 0.261295 hartree
zpe.thermalcorrgfe: 0.193848 hartree
zpe.sumelectzpe: -742.963185 hartree
zpe.sumelectthermal: -742.946143 hartree
zpe.sumelectthermalent: -742.945198 hartree
zpe.sumelectthermalfe: -743.012645 hartree
dipole: -4.1964 -2.8054 0.0054
dipole: 5.0478
quadrupole: -96.8554 -114.8912 -128.4186
quadrupole: 3.4917 0.0849 -0.0032
quadrupole: 16.5330 -1.5028 -15.0302 3.4917 0.0849 -0.0032
hfenergy: -743.2064931 hartree
pointgroup: C01 [X(C17H13Br1O1)]
dipole: -1.7188944 0.9943864 0.0240288 debye
polarizability: 584.8590041|10.4967243|197.3594715|-1.7281431|2.4704563|73.8932612 unknown
InChI: InChI=1S/C17H13BrO/c18-16-12-10-15(11-13-16)17(19)9-5-4-8-14-6-2-1-3-7-14/h1-13H
charge 0 multiplicity 1
32 atoms
Br 7.664457 1.536372 0.003269
O  1.872378 -2.334701 -0.05785
C  3.276284 -0.377148 -0.025244
C  -4.349316 -0.122371 0.006613
C  3.453504 1.031871 0.017535
C  4.431279 -1.205042 -0.058939
C  1.929859 -1.057012 -0.034874
C  -3.022123 -0.74457 -0.007381
C  -4.550622 1.291101 0.024857
C  -5.500794 -0.964528 0.002271
C  4.744707 1.602279 0.026509
C  5.726957 -0.654396 -0.05133
C  0.698868 -0.237308 -0.018298
C  -1.798753 -0.107706 -0.006079
C  5.867716 0.750299 -0.008403
C  -0.546687 -0.827187 -0.020263
C  -5.849453 1.833038 0.038166
C  -6.80138 -0.421295 0.015563
C  -6.982339 0.981322 0.033645
H  2.594275 1.708145 0.046238
H  4.28206 -2.289233 -0.090492
H  -3.014273 -1.845202 -0.019969
H  -3.688671 1.967116 0.028694
H  -5.364502 -2.053036 -0.01158
H  4.872132 2.687773 0.060149
H  6.608565 -1.300926 -0.077974
H  0.775269 0.855547 -0.00591
H  -1.747294 0.990068 0.006227
H  -0.575713 -1.927166 -0.033595
H  -5.985394 2.920123 0.0521
H  -7.671367 -1.086877 0.011967
H  -7.99143 1.407452 0.04408
