program: Gaussian 09
title: 000264866
version: EM64L-G09RevD.01
frameworkgroup: C1[X(C21H18Cl2O)]
method: RPBEPBE
basis: SDD
operation: Freq
keyword: #p
keyword: freq=noraman
keyword: PBEPBE/SDD
title: #p freq=noraman PBEPBE/SDD
converged: YES YES NO NO
title: Mulliken charges:
elementType: Cl Cl O C C C C C C C C C C C C C C C C C C C C C H H H H H H H H H H H H H H H H H H
charge: -0.044060 -0.043945 -0.201789 -0.392651 -0.392697 -0.549446 -0.549432 0.406528 0.406813 -0.167740 -0.421780 -0.421933 0.449584 0.449738 -0.321515 -0.321574 -0.360505 -0.360543 -0.236350 -0.236483 -0.237010 -0.237009 -0.225729 -0.225716 0.205034 0.213110 0.205056 0.213107 0.238480 0.210761 0.238518 0.210777 0.273047 0.273053 0.247474 0.247487 0.257932 0.257935 0.234674 0.234676 0.237061 0.237063
chargesum: 0.00000
title: Mulliken charges with hydrogens summed into heavy atoms:
elementType: Cl Cl O C C C C C C C C C C C C C C C C C C C C C
charge: -0.044060 -0.043945 -0.201789 0.025493 0.025466 -0.100205 -0.100137 0.406528 0.406813 -0.167740 -0.148733 -0.148881 0.449584 0.449738 -0.321515 -0.321574 -0.113031 -0.113056 0.021582 0.021452 -0.002336 -0.002333 0.011331 0.011347
polarizability: 3.93612995e+02 -3.40163680e+01 2.33547650e+02 -4.12252129e-02 4.79291743e-02 1.57715440e+02
1716.lowfreq: -10.1636 -0.0023 -0.0022 -0.0021 4.1934 4.9548 17.0225 18.3035 36.3438
frequency: 16.7715 18.1855 36.3347 37.1369 67.7319 68.5026 89.8267 90.1950 129.6230 136.3254 141.5649 161.3595 193.6654 236.5514 243.9780 257.4903 268.9805 272.0442 305.6646 320.8623 361.1781 375.1126 383.8982 420.9169 433.8401 436.7939 452.9081 468.9169 513.9461 519.9479 520.0086 575.0250 586.7831 642.0304 642.9839 662.3444 668.0898 701.8018 718.6107 733.5204 735.0827 757.5469 760.9849 799.4233 807.2004 841.3342 853.4504 867.2771 868.0697 883.1643 887.6555 900.6099 930.1316 947.4271 951.3787 957.2061 987.0788 987.1013 1018.0769 1018.5935 1029.2477 1036.8287 1047.6649 1055.4915 1098.3181 1115.1641 1123.1181 1124.9648 1133.6216 1172.3465 1172.3548 1209.9623 1218.1361 1228.8059 1232.1863 1247.5063 1256.5187 1265.2096 1298.1832 1313.9515 1321.9583 1334.8039 1344.7873 1356.2431 1358.9433 1365.2427 1366.8458 1416.9171 1417.1857 1461.0639 1461.1055 1461.9672 1463.3450 1469.2276 1470.7318 1518.3076 1563.5178 1563.5711 1599.3796 1600.1160 1632.5989 1645.7925 2970.3796 2976.0388 2981.0823 2982.0782 3025.8780 3039.9473 3071.6758 3072.4337 3090.9736 3091.3842 3131.7804 3131.7921 3144.4383 3144.4430 3160.7443 3160.7529 3175.0839 3175.1296
redmass: 7.1880 6.5551 6.6600 5.3352 5.9695 7.9282 4.1097 4.3057 3.8193 4.5114 6.4319 4.0631 5.3618 3.9173 4.9771 7.3581 4.7892 3.2927 4.7177 2.0041 6.3548 4.9850 5.6658 3.2316 6.1052 2.7160 2.8249 3.7282 3.5654 5.1839 3.4664 2.8484 6.4107 3.3569 4.8384 6.5580 4.6500 3.7172 3.4552 3.1550 4.4907 1.3542 1.3142 3.3015 2.4386 2.3110 2.4854 1.3831 1.4635 1.6194 1.8985 2.0543 2.3612 1.7548 1.3884 2.1131 1.3298 1.3313 6.9701 6.1948 2.7648 2.2207 2.1294 1.8024 1.9769 2.7075 1.6685 1.6447 1.2363 1.0605 1.0599 2.2815 1.7269 1.4743 2.0864 1.3351 1.3845 1.5020 1.3820 1.2471 1.4934 1.7038 1.9288 2.3395 2.0497 2.4403 2.3147 2.2363 2.2409 1.8987 1.1899 2.5039 1.1670 1.1006 1.0934 12.1584 6.0084 6.0142 6.8033 6.8334 8.5323 8.9882 1.0592 1.0652 1.0676 1.0646 1.1000 1.1018 1.0939 1.0935 1.0873 1.0874 1.0866 1.0866 1.0900 1.0900 1.0950 1.0950 1.1000 1.1000
irintensity: 1.0804 1.1416 0.0144 0.8334 0.6642 0.0180 0.1801 0.1957 0.7164 0.1818 0.0250 0.0260 1.4276 1.6750 0.8556 0.0021 4.7044 1.5195 1.7694 0.7009 0.0162 0.6198 19.8140 0.3875 7.4014 1.7262 10.4805 12.4453 0.7087 17.8816 6.9957 1.0093 0.3370 0.5670 7.6149 1.1359 16.8665 6.2653 2.6508 22.4573 18.1225 12.9175 127.7999 19.3327 0.2810 0.0596 0.1082 2.7523 3.6069 23.1095 19.4622 8.1189 27.3161 38.4722 4.2099 34.3934 0.0785 0.2924 4.7434 81.6049 10.3247 0.0353 44.7795 0.0080 0.8070 2.8542 8.5227 3.4785 63.2475 0.2824 0.0753 150.6173 0.3570 0.1445 127.0076 0.0672 7.5981 0.1750 42.5774 0.6673 5.6010 34.2092 1.2310 6.0916 0.0505 0.2371 3.3489 0.2483 35.4054 5.0762 9.7932 84.9060 9.1127 1.6286 29.1790 87.5578 1.0412 12.0592 6.4235 1.7410 97.1711 0.1848 17.3908 30.6314 21.3364 9.1799 35.5801 54.4327 37.6142 5.1840 0.4713 0.1529 2.2060 1.7047 12.1749 3.5413 22.1792 7.6656 34.8092 1.6437
temp: 298.150 k
press: 1.00000 atm
elementType: 17 17 8 6 6 6 6 6 6 6 6 6 6 6 6 6 6 6 6 6 6 6 6 6 1 1 1 1 1 1 1 1 1 1 1 1 1 1 1 1 1 1
symmnumber: 1
zpe: 853951.3 jmol-1
zpe.correction: 0.325253 hartree
zpe.thermalcorrener: 0.347032 hartree
zpe.thermalcorrenthalpy: 0.347976 hartree
zpe.thermalcorrgfe: 0.271465 hartree
zpe.sumelectzpe: -1804.651946 hartree
zpe.sumelectthermal: -1804.630167 hartree
zpe.sumelectthermalent: -1804.629223 hartree
zpe.sumelectthermalfe: -1804.705734 hartree
dipole: -0.0026 -0.0075 4.4538
dipole: 4.4539
quadrupole: -120.2768 -146.1057 -163.6708
quadrupole: -15.8233 -0.0169 0.0188
quadrupole: 23.0743 -2.7546 -20.3197 -15.8233 -0.0169 0.0188
hfenergy: -1804.977199 hartree
pointgroup: C01 [X(C21H18Cl2O1)]
dipole: 0.0009599 1.752281 0.0014235 debye
polarizability: 396.7919653|-0.0338925|157.7156762|25.2619278|-0.1394063|230.3684433 unknown
InChI: InChI=1S/C21H18Cl2O/c22-19-11-5-3-7-15(19)13-17-9-1-2-10-18(21(17)24)14-16-8-4-6-12-20(16)23/h3-8,11-14H,1-2,9-10H2
charge 0 multiplicity 1
42 atoms
Cl -3.920912 -0.574776 2.45637
Cl 3.918562 -0.567172 -2.456929
O  -0.000543 -2.221357 -0.002282
C  -0.765167 2.349965 0.084817
C  0.766672 2.349709 -0.081873
C  -1.324171 1.137358 0.880581
C  1.325003 1.137621 -0.878852
C  -1.301271 -0.19281 0.14301
C  1.301377 -0.193243 -0.1426
C  -0.000115 -0.9485 -0.000211
C  -2.410131 -0.803785 -0.380494
C  2.41005 -0.805278 0.380003
C  -3.816738 -0.322561 -0.358667
C  3.816672 -0.324048 0.358878
C  -4.603476 -0.155222 0.811713
C  4.602667 -0.153341 -0.811471
C  -4.467657 -0.065542 -1.601303
C  4.468206 -0.070288 1.601853
C  -5.945316 0.274813 0.77107
C  5.944533 0.276582 -0.770422
C  -5.805512 0.372381 -1.666966
C  5.806137 0.367365 1.667968
C  -6.547526 0.549703 -0.476045
C  6.547492 0.547897 0.477116
H  -1.250349 2.386429 -0.911137
H  -1.065826 3.27349 0.61822
H  1.251907 2.384971 0.914098
H  1.067748 3.273599 -0.614407
H  -2.364939 1.363672 1.165606
H  -0.753915 1.042198 1.826921
H  2.365927 1.363562 -1.163697
H  0.754642 1.043753 -1.825255
H  -2.241052 -1.7503 -0.915537
H  2.240919 -1.752781 0.913278
H  -3.891728 -0.207476 -2.522918
H  3.892768 -0.214703 2.523389
H  -6.509691 0.380268 1.702099
H  6.5083 0.384841 -1.701497
H  -6.267819 0.569862 -2.639675
H  6.26899 0.562191 2.640954
H  -7.589276 0.885121 -0.511787
H  7.589258 0.883232 0.513184
