program: Gaussian 09
title: 000264851
version: EM64L-G09RevD.01
frameworkgroup: C1[X(C17H14O4)]
method: RPBEPBE
basis: SDD
operation: Freq
keyword: #pfreq=noraman
keyword: PBEPBE/SDD
title: #p freq=noraman PBEPBE/SDD
converged: YES YES NO NO
title: Mulliken charges:
elementType: O O O O C C C C C C C C C C C C C C C C C H H H H H H H H H H H H H H
charge: -0.193918 -0.193917 -0.249031 -0.249032 -0.390405 -0.604208 -0.604208 0.377849 0.377849 -0.062892 -0.062897 -0.404060 -0.404061 0.324491 0.324491 -0.369376 -0.369376 -0.260534 -0.260534 -0.161318 -0.161317 0.223577 0.223577 0.235629 0.267300 0.235629 0.267301 0.279698 0.279698 0.267290 0.267290 0.259661 0.259661 0.265046 0.265046
chargesum: 0.00000
title: Mulliken charges with hydrogens summed into heavy atoms:
elementType: O O O O C C C C C C C C C C C C C C C C C
charge: -0.193918 -0.193917 -0.249031 -0.249032 0.056748 -0.101279 -0.101278 0.377849 0.377849 -0.062892 -0.062897 -0.124362 -0.124362 0.324491 0.324491 -0.102085 -0.102085 -0.000873 -0.000873 0.103728 0.103729
polarizability: 4.07515318e+02 -9.42247929e-05 2.05547822e+02 -1.42136909e+01 -2.54569324e-06 1.11574172e+02
1716.lowfreq: -0.0009 -0.0007 -0.0006 2.4320 5.6500 12.9881 26.6801 33.4787 48.8802
frequency: 26.5797 30.4844 48.8668 63.1883 75.8839 100.3446 103.7754 106.8831 173.2245 186.6324 193.3106 231.1885 250.9360 264.3601 331.6821 334.2991 344.4789 345.1503 404.3467 460.5553 466.6374 517.9196 584.5157 585.0475 598.3871 609.0602 661.4162 662.8004 691.0476 697.9559 738.4385 738.5056 743.3114 744.5511 787.6534 790.9983 817.0423 819.6335 868.4837 868.4876 871.2552 872.2337 881.4481 886.8875 887.2188 908.0721 935.6858 949.4057 951.8919 1015.8542 1017.3623 1036.7704 1048.2817 1049.3208 1057.1246 1065.7638 1111.6492 1133.4267 1133.4989 1161.4883 1188.4952 1191.3333 1231.2727 1245.7146 1267.8768 1274.5804 1287.8852 1292.0056 1325.3552 1325.6431 1350.2238 1355.9155 1377.8923 1380.6919 1461.6105 1461.6950 1464.7936 1482.0371 1486.3945 1518.9538 1520.4142 1538.4582 1541.8421 1649.4634 1650.0963 2979.9810 2981.1536 2988.8822 3051.6752 3092.4483 3092.6933 3099.5831 3100.5686 3220.9960 3221.0111 3235.9378 3235.9463 3266.2532 3266.2590
redmass: 6.7624 4.4028 4.4532 4.6081 9.0950 5.4640 6.1179 5.2579 4.9101 3.9771 6.5559 5.0486 4.8311 6.2392 2.9156 3.4949 4.0931 12.6804 3.5298 4.6750 3.3617 4.3039 2.9783 3.0509 5.8842 3.3938 4.1765 4.2628 6.3845 3.4377 1.2668 1.2692 3.5792 5.4003 1.8382 3.9711 1.3267 1.4554 5.7483 5.8245 4.2831 5.0453 3.5039 1.3676 1.3689 3.1449 1.9907 1.5330 1.4630 1.7253 1.8423 1.8572 3.5709 1.9799 2.0031 2.5572 2.7328 1.5687 1.5802 1.1950 1.4607 1.9145 2.0806 1.5515 1.7032 4.6761 2.3980 1.2968 1.3847 1.3332 2.0211 2.1079 2.2277 2.0877 2.2732 4.4616 1.4129 1.1457 1.1232 7.7077 9.3737 6.4355 7.2360 8.4994 8.4773 1.0701 1.0699 1.0595 1.1025 1.0874 1.0875 1.0918 1.0921 1.0927 1.0927 1.0976 1.0976 1.1087 1.1087
irintensity: 1.0157 0.9960 0.4299 2.5887 0.1974 1.1114 0.0045 0.3671 1.0543 3.0930 0.3553 2.1071 8.3624 0.2010 0.6553 1.4228 10.3085 1.6479 0.0522 32.6277 4.1274 9.2479 2.6640 23.8614 70.9192 0.8942 6.7931 1.0227 2.3369 38.9657 29.1571 138.5600 3.9591 2.7614 22.9934 5.9998 38.1380 13.7242 4.1434 2.8858 0.2555 9.4513 0.2677 2.3206 0.0288 181.3952 3.9542 43.5305 3.6216 4.8717 9.5305 65.4174 11.6589 146.8996 1.2234 1.0113 296.3021 4.1885 9.7200 9.4138 4.3088 38.7064 6.9602 71.3532 0.0169 4.8322 40.0013 5.0780 10.8651 4.4329 0.3804 10.0200 14.5738 4.8779 29.5045 17.5793 2.9937 0.6133 45.4377 333.8553 331.7953 30.7196 59.1630 16.9216 122.4557 28.2230 1.0057 27.7455 43.8335 3.1847 0.4986 3.3116 2.9785 5.6937 2.2787 1.4184 0.7297 0.0051 0.0056
temp: 298.150 k
press: 1.00000 atm
elementType: 8 8 8 8 6 6 6 6 6 6 6 6 6 6 6 6 6 6 6 6 6 1 1 1 1 1 1 1 1 1 1 1 1 1 1
symmnumber: 1
zpe: 698300.6 jmol-1
zpe.correction: 0.265969 hartree
zpe.thermalcorrener: 0.283875 hartree
zpe.thermalcorrenthalpy: 0.284819 hartree
zpe.thermalcorrgfe: 0.218029 hartree
zpe.sumelectzpe: -955.540248 hartree
zpe.sumelectthermal: -955.522342 hartree
zpe.sumelectthermalent: -955.521397 hartree
zpe.sumelectthermalfe: -955.588188 hartree
dipole: 0.0000 6.8425 0.0000
dipole: 6.8425
quadrupole: -72.0907 -132.0480 -124.6004
quadrupole: 0.0001 -1.4748 0.0001
quadrupole: 37.4890 -22.4683 -15.0207 0.0001 -1.4748 0.0001
hfenergy: -955.8062168 hartree
pointgroup: C01 [X(C17H14O4)]
dipole: -0.0000386 -2.6920558 -0.000007 debye
polarizability: 408.0592384|-0.0017454|205.547822|6.3847349|0.0005298|111.0302521 unknown
InChI: InChI=1S/C17H14O4/c18-16-12(10-14-6-2-8-20-14)4-1-5-13(17(16)19)11-15-7-3-9-21-15/h2-3,6-11H,1,4-5H2
charge 0 multiplicity 1
35 atoms
O  1.151598 2.822097 0.919596
O  -1.151477 2.822118 -0.919555
O  3.814392 -1.427032 -0.63608
O  -3.81436 -1.42697 0.636079
C  0.000015 -1.30788 0.000009
C  0.926856 -0.45379 -0.918752
C  -0.926814 -0.453784 0.918777
C  1.599583 0.680132 -0.167029
C  -1.599515 0.68016 0.167064
C  0.738898 1.834674 0.237506
C  -0.738807 1.834693 -0.23745
C  2.927858 0.751653 0.202787
C  -2.927787 0.75171 -0.202757
C  4.011177 -0.168754 0.002452
C  -4.011122 -0.16868 -0.002438
C  5.364152 -0.063136 0.35269
C  -5.364095 -0.063034 -0.352677
C  6.026873 -1.267145 -0.070551
C  -6.026837 -1.267037 0.070549
C  5.060205 -2.067903 -0.663545
C  -5.060184 -2.067819 0.663534
H  -0.621076 -1.963829 -0.639491
H  0.621096 -1.963844 0.639503
H  0.314076 -0.026367 -1.738151
H  1.674587 -1.11059 -1.387405
H  -0.314029 -0.026382 1.738184
H  -1.674559 -1.110576 1.387417
H  3.217817 1.665197 0.743893
H  -3.217727 1.665266 -0.743853
H  5.815556 0.79087 0.854693
H  -5.815483 0.790986 -0.85467
H  7.080256 -1.512619 0.045778
H  -7.080225 -1.512491 -0.045786
H  5.073572 -3.051486 -1.125347
H  -5.073569 -3.051408 1.125324
