program: Gaussian 09
title: 000264842
version: EM64L-G09RevD.01
frameworkgroup: C1[X(C15H20N2)]
method: RPBEPBE
basis: SDD
operation: Freq
keyword: #pfreq=noraman
keyword: PBEPBE/SDD
title: #p freq=noraman PBEPBE/SDD
converged: YES YES NO NO
title: Mulliken charges:
elementType: N N C C C C C C C C C C C C C C C H H H H H H H H H H H H H H H H H H H H
charge: -0.072485 -0.457189 -0.358765 -0.355258 -0.398696 -0.392256 -0.398780 -0.492023 0.235624 0.114979 0.136048 0.206836 -0.406947 -0.797790 -0.365096 -0.257699 -0.222489 0.237111 0.161633 0.161659 0.208324 0.208877 0.189365 0.188764 0.203239 0.186459 0.212001 0.218872 0.176473 0.296447 0.260823 0.244232 0.239730 0.230733 0.223940 0.216351 0.216953
chargesum: 0.00000
title: Mulliken charges with hydrogens summed into heavy atoms:
elementType: N N C C C C C C C C C C C C C C C
charge: -0.072485 -0.160742 0.039980 0.014725 -0.000455 -0.000253 -0.000320 -0.096678 0.235624 0.114979 0.136048 0.206836 -0.146124 -0.083094 -0.141156 -0.041347 -0.005537
polarizability: 1.98102541e+02 7.72375413e+00 2.02252383e+02 -1.73547370e+01 5.11569975e+00 1.20105923e+02
1716.lowfreq: -9.6610 -5.7362 -0.0003 0.0005 0.0005 7.8650 23.1146 50.0835 56.0905
frequency: 22.8651 49.9797 55.9175 87.5787 125.2899 128.7204 158.4348 221.3098 238.7823 250.8479 286.0698 296.4373 311.1142 337.2147 382.3488 431.4334 444.2122 447.6869 482.8597 493.3057 507.9594 563.6273 576.7409 586.5106 643.1845 651.9412 734.1119 749.0529 754.2035 765.5413 803.9648 847.9163 851.6181 854.6819 856.6940 886.7387 930.8436 934.6282 958.9247 970.3167 971.5153 988.8991 1007.4203 1026.6653 1041.1430 1045.3511 1079.2956 1093.3365 1107.2888 1122.7905 1143.8987 1149.9059 1152.6945 1167.7273 1198.6588 1231.7911 1243.3959 1254.8743 1262.7732 1274.4309 1289.4818 1304.1859 1328.6541 1335.8236 1340.4622 1342.1434 1348.6544 1362.4153 1385.0063 1399.7440 1413.8361 1427.4784 1449.8429 1455.7572 1459.2522 1464.9114 1466.6908 1467.5947 1468.8679 1472.7425 1479.0997 1482.4973 1580.6927 1599.0386 1633.2856 2798.0393 2808.0973 2831.5837 2964.6623 2965.7183 2974.0431 2983.1163 2985.9747 3014.1461 3031.0895 3034.6885 3040.4893 3044.4240 3053.6311 3093.4182 3120.2707 3131.9501 3150.5336 3164.9172 3604.0528
redmass: 3.4398 3.1915 3.3371 1.1564 2.8780 3.1017 4.1625 2.4545 2.5484 2.2317 4.2004 1.9562 3.3764 4.4049 1.7178 2.9473 3.1534 2.9372 5.1783 1.1948 2.4916 2.3162 3.5085 4.1331 3.8985 5.1574 4.0710 1.4461 3.6405 3.4266 1.4843 2.4082 2.6623 1.6979 1.5790 3.0598 1.8376 1.8618 1.2995 1.5570 1.3130 2.6077 2.1144 2.0995 1.4839 2.1509 1.4659 2.2138 1.9272 2.4594 2.1482 1.6006 1.5476 1.2516 1.3862 1.4077 2.4227 1.3290 1.2128 1.3408 1.4347 3.4819 1.3005 1.5454 1.5675 1.5167 1.4957 1.4396 1.5414 1.4027 3.0539 2.6964 1.0923 1.0909 1.0876 3.4160 1.1129 1.1378 1.0954 1.1884 1.1180 2.4596 6.6560 6.5012 6.7648 1.0717 1.0706 1.0694 1.0623 1.0395 1.0855 1.0619 1.0614 1.0864 1.0955 1.0978 1.0880 1.1029 1.1034 1.0951 1.0851 1.0900 1.0953 1.0988 1.0803
irintensity: 0.1108 0.1299 0.8773 0.0447 1.5907 2.4194 2.0850 0.0898 0.6464 0.8399 1.1148 4.8714 0.1911 2.9474 2.7762 6.1835 2.6546 0.5936 0.0500 83.0749 1.0143 1.0991 7.7710 9.7552 7.8755 0.9852 10.3644 87.8989 7.8403 8.0587 0.0422 1.0854 2.7652 0.2678 6.2027 0.9352 6.5089 0.1153 2.9046 1.5881 0.9164 34.6228 10.0913 13.5016 3.1013 9.1757 9.9060 33.3809 7.1724 3.4726 11.2772 14.0066 10.9969 1.7505 1.4112 7.0005 15.0412 4.1631 2.7455 16.4761 5.1812 30.6178 5.9775 0.7117 9.4846 25.4273 2.2653 1.6563 0.5771 2.7418 30.5552 34.4453 7.2544 3.4788 14.0252 28.2990 5.2099 17.8147 4.3438 8.6476 11.7206 2.0673 7.7858 11.5449 6.3081 45.2119 87.7321 208.8296 39.7174 69.5158 27.9301 28.8952 30.2298 66.8129 71.3568 19.8260 27.6782 16.2147 94.9097 15.0915 0.3797 19.6783 31.9486 22.0511 45.0955
temp: 298.150 k
press: 1.00000 atm
elementType: 7 7 6 6 6 6 6 6 6 6 6 6 6 6 6 6 6 1 1 1 1 1 1 1 1 1 1 1 1 1 1 1 1 1 1 1 1
symmnumber: 1
zpe: 836180.5 jmol-1
zpe.correction: 0.318484 hartree
zpe.thermalcorrener: 0.334000 hartree
zpe.thermalcorrenthalpy: 0.334945 hartree
zpe.thermalcorrgfe: 0.275015 hartree
zpe.sumelectzpe: -691.838917 hartree
zpe.sumelectthermal: -691.823401 hartree
zpe.sumelectthermalent: -691.822457 hartree
zpe.sumelectthermalfe: -691.882387 hartree
dipole: -0.3509 2.8979 0.6937
dipole: 3.0003
quadrupole: -91.8462 -93.6600 -104.0647
quadrupole: -6.4529 -5.7289 1.8460
quadrupole: 4.6774 2.8636 -7.5411 -6.4529 -5.7289 1.8460
hfenergy: -692.1574018 hartree
pointgroup: C01 [X(C15H20N2)]
dipole: -0.133693 1.1187814 0.3518905 debye
polarizability: 199.0128267|8.7370303|200.8827656|-14.8698248|11.3850124|120.5652539 unknown
InChI: InChI=1S/C15H20N2/c1-12-14(11-17-9-5-2-6-10-17)13-7-3-4-8-15(13)16-12/h3-4,7-8,16H,2,5-6,9-11H2,1H3
charge 0 multiplicity 1
37 atoms
N  1.830147 0.197013 -0.37192
N  -2.628532 1.402382 0.46457
C  2.01981 0.361541 1.09018
C  3.120931 0.252974 -1.100742
C  2.947155 -0.733415 1.654849
C  4.081213 -0.848693 -0.608383
C  4.305794 -0.736376 0.917016
C  0.84232 1.159947 -0.933724
C  -0.549914 0.980881 -0.382682
C  -1.307056 -0.262096 -0.363148
C  -1.384649 1.979059 0.135384
C  -2.610089 0.033462 0.171233
C  -1.004653 -1.596971 -0.740444
C  -1.156514 3.449826 0.347529
C  -3.608228 -0.95278 0.32426
C  -1.998013 -2.586339 -0.594914
C  -3.28539 -2.268878 -0.069536
H  1.027745 0.311935 1.573187
H  2.456347 1.371839 1.324465
H  3.618119 1.253734 -0.971844
H  2.917015 0.12632 -2.181428
H  2.452497 -1.715641 1.526913
H  3.091715 -0.569354 2.740208
H  5.042681 -0.770633 -1.152057
H  3.639369 -1.836104 -0.845159
H  4.845431 0.208277 1.138587
H  4.944062 -1.5655 1.277298
H  0.831871 0.994686 -2.030856
H  1.175203 2.220261 -0.778639
H  -3.416237 1.912871 0.85771
H  -0.006028 -1.839221 -1.116552
H  -0.097354 3.704629 0.181301
H  -1.75923 4.067277 -0.347244
H  -1.417051 3.758977 1.378393
H  -4.597423 -0.714862 0.732117
H  -1.780512 -3.621141 -0.883329
H  -4.035853 -3.060986 0.033702
