program: Gaussian 09
title: 000264846
version: EM64L-G09RevD.01
frameworkgroup: C1[X(C15H29NO4)]
method: RPBEPBE
basis: SDD
operation: Freq
keyword: #p
keyword: freq=noraman
keyword: PBEPBE/SDD
title: #p freq=noraman PBEPBE/SDD
converged: YES YES NO NO
title: Mulliken charges:
elementType: O O O O N C C C C C C C C C C C C C C C H H H H H H H H H H H H H H H H H H H H H H H H H H H H H
charge: -0.267849 -0.267430 -0.245584 -0.245469 -0.085690 -0.354192 -0.371488 -0.386427 -0.358731 -0.364678 -0.364598 -0.637089 -0.511336 -0.512132 0.246222 0.245672 -0.262801 -0.262842 -0.664880 -0.664644 0.207227 0.179242 0.203370 0.182976 0.195005 0.210475 0.190940 0.210005 0.203327 0.224358 0.224998 0.202134 0.223612 0.186934 0.225784 0.238221 0.245835 0.248240 0.237208 0.222409 0.233736 0.233601 0.222374 0.226751 0.248544 0.216764 0.248430 0.226875 0.216591
chargesum: 0.00000
title: Mulliken charges with hydrogens summed into heavy atoms:
elementType: O O O O N C C C C C C C C C C C C C C C
charge: -0.267849 -0.267430 -0.245584 -0.245469 -0.085690 0.032278 0.014858 0.019053 0.042215 0.063007 0.062534 -0.000759 -0.027279 -0.026685 0.246222 0.245672 0.193344 0.193132 0.027179 0.027252
polarizability: 2.33980660e+02 -3.35346239e+00 1.77449515e+02 2.38121338e+00 5.21619712e-01 1.48840725e+02
1716.lowfreq: -17.8023 -8.7184 -3.0962 -0.0011 0.0008 0.0014 4.2509 6.3332 11.1993
frequency: -15.7750 5.8575 10.2367 22.3603 31.2280 42.9508 48.6130 59.9535 72.0395 75.5581 84.1934 85.5842 106.8368 116.3808 127.2167 135.6767 153.9707 175.2789 196.8920 209.7137 216.3780 232.4909 246.5389 293.0525 305.7949 335.1567 341.8453 366.1187 377.2960 413.3693 454.2240 459.9128 478.5248 521.7724 568.1747 570.6130 663.7477 665.9248 731.9897 733.1395 782.1823 783.8192 786.8775 789.2068 814.6786 816.5884 825.4294 891.7543 894.1969 906.2041 908.2485 996.3239 1009.0441 1016.0688 1034.6661 1048.0633 1051.2776 1060.5835 1073.0981 1081.4393 1086.1794 1088.2690 1094.9798 1095.2614 1104.4629 1106.7615 1136.3687 1144.8903 1156.1680 1156.3074 1159.0255 1203.3550 1224.2987 1237.5156 1244.9538 1261.5291 1269.0238 1277.9924 1278.5938 1282.8122 1285.2866 1293.4929 1305.5283 1317.9567 1321.1783 1350.5862 1352.0647 1362.8227 1364.5938 1371.9273 1377.2949 1388.4073 1390.7376 1431.2498 1443.5654 1443.8689 1457.0302 1457.2393 1462.5904 1463.1926 1463.7984 1465.2421 1467.3170 1471.8777 1475.2097 1480.2309 1484.5053 1484.8131 1486.8097 1487.9630 1641.8768 1641.9333 2830.2468 2840.2742 2856.9416 2974.4463 2975.1558 2977.4205 2977.4986 2988.6840 2989.9958 2991.6978 2992.2128 3007.8514 3018.7263 3026.3487 3027.6318 3027.7959 3028.3951 3032.8856 3047.7197 3049.9915 3068.4416 3068.8752 3082.3876 3087.0028 3087.3158 3090.8103 3091.4893 3117.1134 3117.6787
redmass: 4.3004 4.3203 4.8172 3.1121 3.2893 3.7161 3.3424 2.4668 2.3874 2.8452 2.4395 2.6161 3.4512 2.7742 2.5775 2.1000 3.0991 2.2060 1.7813 1.9347 1.3217 1.9136 1.7672 2.4784 2.4858 3.4558 3.4203 2.7166 3.3183 2.9389 3.1536 3.3458 3.2163 3.1127 3.0930 3.1172 3.9158 3.8864 1.1162 1.1121 1.9796 2.1044 1.2872 1.3156 1.8314 1.6999 3.5023 3.5232 3.3551 1.4314 1.4089 2.7219 2.8916 2.7684 3.5111 3.5511 3.6416 2.6002 2.1533 2.0030 2.3179 2.2831 2.2154 2.1575 1.8386 1.5401 2.3485 2.1860 1.6811 1.6752 1.5800 1.8021 1.7660 1.3013 1.3575 1.4092 1.3762 1.1197 1.1177 1.0937 1.0808 1.1978 1.2266 1.4141 1.4366 1.3372 1.3284 1.5828 1.6070 1.4050 1.4074 1.2336 1.2343 1.1628 1.0861 1.0856 1.0908 1.0913 1.0442 1.0446 1.0774 1.0691 1.0571 1.0838 1.0826 1.0656 1.0515 1.0512 1.0954 1.0882 9.0294 9.0389 1.0714 1.0659 1.0617 1.0611 1.0601 1.0648 1.0649 1.0617 1.0610 1.0359 1.0360 1.0869 1.0907 1.0756 1.0768 1.0762 1.0596 1.0924 1.0988 1.0980 1.0997 1.0997 1.1003 1.0974 1.0974 1.1032 1.1031 1.1061 1.1060
irintensity: 1.1588 1.0085 0.2118 0.0839 0.1893 0.7980 1.3221 0.6393 0.8669 0.8417 0.5005 0.6271 1.8503 0.6984 2.1281 1.1887 0.0904 2.1385 1.4576 0.3512 5.3506 2.8105 2.4124 8.6544 13.1779 8.8261 11.9774 1.3225 2.6837 7.9780 2.1961 6.7211 3.1565 9.6370 3.8462 7.2939 6.3526 5.9610 7.2982 15.3389 8.2001 6.9432 2.0348 1.3408 3.0766 3.7316 15.4548 17.7278 11.9145 1.1584 3.4830 28.0886 27.5756 31.2023 27.8878 3.7832 43.6705 103.7961 4.3257 58.0526 42.6550 14.9968 13.0498 57.4462 40.3851 86.6926 221.3612 45.2270 33.0844 11.5531 100.4185 30.4699 8.7964 30.8957 24.7860 9.1178 51.0304 4.6373 3.5429 1.4660 2.0719 39.3406 9.5063 10.4842 33.0027 2.0629 1.8721 17.4844 22.0869 7.9201 2.3309 22.4227 22.5764 3.6868 20.2439 20.2712 12.1085 12.2313 13.7169 14.1826 0.6562 0.1989 11.4907 5.2208 0.1462 2.2767 12.4342 11.8518 26.7446 19.4512 111.1281 186.5749 53.4301 61.9554 215.8672 9.8440 10.4868 3.9296 3.2109 41.2286 46.3098 19.8690 20.2682 20.0395 10.9187 28.7332 48.8678 8.1578 30.3738 9.3017 24.3789 31.9250 61.2287 57.9466 49.7926 39.4865 36.0055 0.6423 0.7404 34.7151 35.0305
temp: 298.150 k
press: 1.00000 atm
elementType: 8 8 8 8 7 6 6 6 6 6 6 6 6 6 6 6 6 6 6 6 1 1 1 1 1 1 1 1 1 1 1 1 1 1 1 1 1 1 1 1 1 1 1 1 1 1 1 1 1
symmnumber: 1
zpe: 1113007.5 jmol-1
zpe.correction: 0.423922 hartree
zpe.thermalcorrener: 0.448631 hartree
zpe.thermalcorrenthalpy: 0.449576 hartree
zpe.thermalcorrgfe: 0.362430 hartree
zpe.sumelectzpe: -942.998540 hartree
zpe.sumelectthermal: -942.973831 hartree
zpe.sumelectthermalent: -942.972887 hartree
zpe.sumelectthermalfe: -943.060033 hartree
dipole: -0.9705 0.0760 -1.5226
dipole: 1.8072
quadrupole: -98.2490 -118.2384 -129.4282
quadrupole: -6.4061 -5.7298 2.8483
quadrupole: 17.0562 -2.9332 -14.1230 -6.4061 -5.7298 2.8483
hfenergy: -943.4224624 hartree
pointgroup: C01 [X(C15H29N1O4)]
dipole: 0.3840694 -0.0648085 -0.594847 debye
polarizability: 233.920187|-4.0629047|177.3996948|-1.8134889|-1.989174|148.9510179 unknown
InChI: InChI=1S/C15H29NO4/c1-4-19-14(17)10-6-8-12-16(3)13-9-7-11-15(18)20-5-2/h4-13H2,1-3H3
charge 0 multiplicity 1
49 atoms
O  6.765688 0.551636 -0.20509
O  -6.260284 1.367718 -1.02495
O  5.042193 1.816102 0.732384
O  -5.94965 0.387984 1.070953
N  0.000234 -2.592743 -0.159442
C  0.966094 -1.668467 0.487186
C  -1.404008 -2.358206 0.269426
C  2.270655 -1.488787 -0.318305
C  -2.033938 -1.108685 -0.382115
C  3.225639 -0.472763 0.345527
C  -3.490664 -0.883101 0.079121
C  0.397886 -4.008835 -0.010891
C  4.533632 -0.297293 -0.455188
C  -4.131157 0.339197 -0.611024
C  5.422465 0.804205 0.098816
C  -5.51193 0.670973 -0.068405
C  7.754412 1.593164 0.216851
C  -7.621497 1.827133 -0.605285
C  7.874919 2.68905 -0.845804
C  -7.541919 3.185283 0.097139
H  0.484148 -0.67817 0.585556
H  1.216016 -2.00551 1.528169
H  -1.99816 -3.243067 -0.031741
H  -1.492727 -2.28235 1.384861
H  2.789596 -2.461864 -0.429784
H  2.002795 -1.153101 -1.339243
H  -1.433541 -0.208089 -0.141165
H  -1.988362 -1.232148 -1.481717
H  3.4677 -0.800839 1.37614
H  2.729859 0.511789 0.442369
H  -3.529703 -0.739767 1.175581
H  -4.096746 -1.785426 -0.13685
H  1.406875 -4.167847 -0.428793
H  0.410331 -4.355108 1.054625
H  -0.301529 -4.652407 -0.573456
H  4.291472 -0.028188 -1.504387
H  5.11472 -1.235261 -0.50354
H  -4.199874 0.202729 -1.704963
H  -3.493068 1.233548 -0.452364
H  8.69171 1.026412 0.335712
H  7.432202 2.009463 1.187615
H  -8.062718 1.059477 0.054655
H  -8.17961 1.882863 -1.553634
H  8.137008 2.258627 -1.827772
H  6.92868 3.247896 -0.940422
H  8.668814 3.403346 -0.558386
H  -6.984222 3.102981 1.045233
H  -7.047093 3.933465 -0.545982
H  -8.560944 3.54778 0.328078
