program: Gaussian 09
title: 000264847
version: EM64L-G09RevD.01
frameworkgroup: C1[X(C16H18N2O2)]
method: RPBEPBE
basis: SDD
operation: Freq
keyword: #p
keyword: freq=noraman
keyword: PBEPBE/SDD
title: #p freq=noraman PBEPBE/SDD
converged: YES YES NO NO
title: Mulliken charges:
elementType: O O N N C C C C C C C C C C C C C C C C H H H H H H H H H H H H H H H H H H
charge: -0.197793 -0.226309 -0.423355 0.152938 -0.337076 -0.096600 -0.370486 0.522951 -0.692558 0.468888 -0.431707 -0.399497 -0.222534 -0.239006 -0.443169 -0.361161 -0.240520 -0.196100 -0.224738 -0.268558 0.251482 0.253081 0.225692 0.231773 0.287172 0.224129 0.235307 0.216138 0.239790 0.230747 0.231781 0.230126 0.213799 0.253411 0.234390 0.220620 0.221316 0.225632
chargesum: 0.00000
title: Mulliken charges with hydrogens summed into heavy atoms:
elementType: O O N N C C C C C C C C C C C C C C C C
charge: -0.197793 -0.226309 -0.136183 0.152938 -0.085593 0.156481 0.086978 0.522951 -0.016984 0.468888 -0.191916 -0.168749 0.009247 -0.008880 -0.229370 -0.107751 -0.006129 0.024520 -0.003422 -0.042925
polarizability: 2.34737746e+02 -9.68010793e+00 1.79960750e+02 1.89620204e+01 -2.36133332e+00 1.66971038e+02
1716.lowfreq: -4.0983 -0.0005 -0.0002 0.0004 6.9622 10.8355 17.4274 32.0535 38.2020
frequency: 16.9652 31.7747 38.1210 42.8328 61.1017 66.2893 77.2203 105.0162 147.8867 168.2353 180.6200 211.7675 214.0147 251.6402 279.1596 289.2045 306.2134 400.3255 407.1542 414.0489 443.7005 488.2576 506.0610 538.1316 549.7087 571.0420 611.7243 615.4084 618.0699 661.8040 666.8578 692.0179 705.3244 754.5481 765.9730 773.1443 812.4291 822.2697 838.5054 852.5001 875.1071 882.9398 915.6993 922.4138 955.9662 975.3118 976.8282 981.6180 989.9183 999.0664 1010.7754 1026.2922 1027.6928 1058.0784 1069.2058 1083.0179 1096.5902 1110.8624 1124.2370 1169.9747 1174.9466 1188.7777 1191.2385 1200.3365 1213.9568 1235.0568 1258.4868 1269.6029 1281.9943 1293.5596 1324.0988 1338.0268 1341.2710 1341.6375 1380.8956 1385.7606 1401.2986 1430.5835 1434.7138 1442.1904 1459.7869 1476.5713 1481.7920 1483.9695 1485.6283 1499.6423 1592.0875 1594.4441 1610.2973 1617.7045 2986.1382 3000.3713 3047.8342 3055.9488 3066.9981 3084.7570 3089.8032 3108.2077 3110.9184 3125.0143 3126.5387 3136.8267 3138.1056 3148.6875 3153.2072 3166.8346 3166.9877 3509.1040
redmass: 4.6147 4.7656 4.8741 3.9649 4.1139 3.3957 4.7832 4.1234 5.0526 3.9160 1.8524 2.6511 3.5627 4.1025 3.5896 3.4560 3.7393 2.7989 2.9111 3.8492 2.6408 4.0886 3.2040 1.9774 5.5817 3.2499 3.8543 6.1084 5.3384 6.6353 3.3042 1.9069 1.7091 1.7627 2.3699 1.8827 4.1772 1.3166 2.4930 1.2501 2.2041 1.6703 1.8665 1.4761 1.3839 1.4890 1.3907 3.6197 6.1005 1.3279 3.9855 2.2671 2.2406 1.9263 2.5780 1.6488 2.0120 2.2175 2.2877 1.0491 1.0608 1.1955 1.1375 1.9814 2.3606 1.5251 1.8566 1.7069 2.0489 1.2848 1.4885 1.3099 1.3349 1.4428 5.6983 3.9706 1.2031 2.9165 2.6215 2.1045 1.1387 1.0521 2.2227 1.0541 2.1216 1.7801 5.9389 4.8968 6.1038 6.1833 1.0364 1.0610 1.0867 1.0934 1.0900 1.0996 1.1005 1.0877 1.0879 1.0870 1.0859 1.0904 1.0924 1.0956 1.0940 1.1013 1.1010 1.0754
irintensity: 0.3851 0.2020 1.8944 0.2966 0.4202 0.1494 0.2601 0.4428 0.4664 2.0757 1.1830 0.3750 0.7763 1.1894 3.4814 0.8920 4.1561 0.0269 0.1442 2.9381 20.0042 6.0373 25.9012 30.4892 34.8572 32.4103 19.1899 4.7488 8.2745 1.8340 0.9532 44.3466 54.3459 78.9379 36.2160 20.9281 7.7415 0.1218 5.8159 0.0608 17.9248 1.5985 10.2527 3.8665 0.1381 1.2597 0.0163 2.0749 0.7494 0.2359 2.3522 9.2861 1.5870 2.4493 30.0577 11.1364 18.2559 0.7844 19.5589 0.9631 0.3172 4.0308 2.2312 18.2016 29.2650 5.6074 28.3787 23.6009 99.9692 20.3098 22.3987 5.3152 5.2590 1.1061 13.5610 5.3910 11.2440 66.3265 43.8638 25.5485 4.1543 9.6410 9.9731 16.8818 62.9088 136.2202 2.0219 10.3449 13.7036 150.7925 26.6536 13.3194 0.3603 2.0326 2.1850 36.3556 33.2519 15.0738 10.7459 4.5027 2.0677 6.1166 28.6110 29.7351 24.8679 27.3403 14.3775 7.5680
temp: 298.150 k
press: 1.00000 atm
elementType: 8 8 7 7 6 6 6 6 6 6 6 6 6 6 6 6 6 6 6 6 1 1 1 1 1 1 1 1 1 1 1 1 1 1 1 1 1 1
symmnumber: 1
zpe: 806889.0 jmol-1
zpe.correction: 0.307328 hartree
zpe.thermalcorrener: 0.326165 hartree
zpe.thermalcorrenthalpy: 0.327109 hartree
zpe.thermalcorrgfe: 0.257385 hartree
zpe.sumelectzpe: -878.915905 hartree
zpe.sumelectthermal: -878.897068 hartree
zpe.sumelectthermalent: -878.896124 hartree
zpe.sumelectthermalfe: -878.965848 hartree
dipole: 4.2338 -3.7873 -0.1966
dipole: 5.6839
quadrupole: -111.5029 -126.5976 -111.5737
quadrupole: 2.9930 2.6118 -5.2729
quadrupole: 5.0552 -10.0395 4.9844 2.9930 2.6118 -5.2729
hfenergy: -879.223233 hartree
pointgroup: C01 [X(C16H18N2O2)]
dipole: -0.7775884 -2.062749 -0.3756393 debye
polarizability: 212.6387503|23.2971937|194.0224969|23.3836752|17.5742253|175.008286 unknown
InChI: InChI=1S/C16H18N2O2/c1-2-15(18(19)20)16(13-9-5-3-6-10-13)17-14-11-7-4-8-12-14/h3-12,15-17H,2H2,1H3
charge 0 multiplicity 1
38 atoms
O  -1.573523 3.181147 -0.801856
O  -0.989282 2.570899 1.314739
N  0.650246 0.45363 -0.663472
N  -1.408907 2.309369 0.124709
C  -0.522753 -0.03421 0.094783
C  -1.775704 0.849827 -0.183322
C  -3.009083 0.467368 0.665999
C  -0.805477 -1.508855 -0.217808
C  -4.25413 1.330341 0.373453
C  1.90994 0.729803 -0.078552
C  -0.507959 -2.507438 0.742509
C  -1.304439 -1.908673 -1.486384
C  -0.702817 -3.875159 0.446318
C  -1.498814 -3.27484 -1.785302
C  3.08858 0.543976 -0.857332
C  2.038407 1.235524 1.246395
C  -1.199376 -4.263618 -0.818969
C  4.356862 0.850323 -0.324566
C  3.315758 1.52078 1.77277
C  4.484849 1.33266 0.99943
H  -0.291262 0.061107 1.169456
H  -2.023852 0.86353 -1.25861
H  -2.734631 0.539008 1.73601
H  -3.22968 -0.594957 0.455865
H  0.694639 0.115183 -1.62864
H  -5.116238 0.969709 0.961758
H  -4.090363 2.390705 0.63587
H  -4.531277 1.286364 -0.696007
H  -0.115524 -2.212206 1.723052
H  -1.546003 -1.157804 -2.250091
H  -0.466731 -4.634874 1.199528
H  -1.88506 -3.568812 -2.767653
H  3.004802 0.154117 -1.880318
H  1.148038 1.453759 1.844447
H  -1.350696 -5.323608 -1.050358
H  5.249049 0.701306 -0.943752
H  3.393068 1.915015 2.792708
H  5.471043 1.56441 1.414692
