program: Gaussian 09
title: 000264841
version: EM64L-G09RevD.01
frameworkgroup: C1[X(C15H16O2S2)]
method: RPBEPBE
basis: SDD
operation: Freq
keyword: #p
keyword: freq=noraman
keyword: PBEPBE/SDD
title: #p freq=noraman PBEPBE/SDD
converged: YES YES NO NO
title: Mulliken charges:
elementType: S S O O C C C C C C C C C C C C C C C H H H H H H H H H H H H H H H H
charge: 0.671552 0.673463 -0.606965 -0.629059 -0.810752 -0.840621 -0.801968 0.486014 0.489856 -0.363231 -0.341382 -0.395135 -0.399722 -0.219292 -0.220379 -0.216493 -0.217104 -0.235094 -0.230846 0.308141 0.307450 0.337886 0.294369 0.256427 0.302993 0.260927 0.269050 0.254800 0.231337 0.228670 0.232820 0.228054 0.231056 0.229573 0.233603
chargesum: 0.00000
title: Mulliken charges with hydrogens summed into heavy atoms:
elementType: S S O O C C C C C C C C C C C C C C C
charge: 0.671552 0.673463 -0.606965 -0.629059 -0.195161 -0.208366 -0.242548 0.486014 0.489856 -0.102304 -0.072332 -0.140335 -0.168385 0.009378 0.012441 0.011561 0.013952 -0.005521 0.002757
polarizability: 3.58904607e+02 3.67501637e+00 2.22115642e+02 1.06234729e+01 7.86581892e+00 1.17471439e+02
1716.lowfreq: -9.1836 -0.0005 0.0010 0.0014 2.2799 3.2035 13.9937 15.3916 26.9633
frequency: 13.8513 15.1566 26.7358 40.2899 51.4186 55.7334 74.9714 90.2458 122.3625 139.0857 175.9026 195.7250 210.1055 249.1656 261.5054 265.6519 327.7122 345.5966 361.7430 402.0806 402.4720 421.6583 431.6960 514.3176 529.4337 538.4329 554.1725 578.8946 609.2779 615.8250 615.9557 698.5000 702.7762 759.2970 772.3963 775.2591 790.3749 797.5063 809.7937 816.8189 849.5731 855.8237 887.2209 914.3652 927.4377 934.1242 977.2988 981.6233 988.6895 988.7337 998.7410 999.7605 1026.3868 1026.5595 1057.9946 1075.3265 1079.2958 1126.2803 1140.5939 1153.8879 1173.3980 1175.1189 1190.0057 1190.5688 1201.0147 1230.8925 1233.4279 1241.3800 1330.4114 1331.2677 1344.1511 1385.4217 1386.3517 1423.2608 1439.3802 1442.7795 1453.7571 1483.3133 1483.3977 1589.2848 1589.6172 1610.7874 1611.4260 2984.2743 3035.1708 3037.2783 3097.4623 3119.9444 3123.0888 3128.2023 3129.1880 3132.6264 3140.2709 3144.4108 3150.8480 3154.1099 3155.6006 3165.3647 3169.1858
redmass: 5.6343 5.1743 4.5739 4.6386 7.0719 4.5243 5.9676 5.4999 7.2311 4.4006 10.0448 6.2552 6.7115 6.7688 5.2228 5.4444 3.7109 2.5666 2.1630 2.8087 2.8138 5.1812 4.6749 4.7178 5.1565 6.0854 4.8602 3.8363 5.8159 6.3128 6.2956 1.7030 1.6847 2.9974 1.9297 2.0638 3.0211 13.1269 4.2734 3.3007 1.2593 1.2483 1.6110 1.5494 1.4552 1.4643 1.4340 1.4482 5.3368 5.1594 1.3298 1.3389 2.1908 2.1979 1.0962 1.4374 1.5068 1.1162 1.1109 1.1326 1.0529 1.0532 1.1142 1.1231 1.1648 2.9334 3.0020 1.1582 1.2728 1.2620 1.0786 8.0076 8.6073 1.1560 1.7673 2.1843 1.3048 2.3288 2.3233 5.9577 5.9435 5.9796 5.9760 1.0608 1.0560 1.0525 1.1088 1.0882 1.0854 1.1099 1.0879 1.0873 1.0925 1.0919 1.0968 1.1133 1.0965 1.1017 1.1016
irintensity: 0.1057 1.1361 0.5248 0.4569 1.4947 2.8238 1.5690 7.1890 13.5868 4.1655 2.3550 7.2091 7.1645 2.3616 11.9858 6.5844 3.3998 0.8596 4.7447 0.4218 0.1335 3.0135 4.2069 7.6797 14.8376 26.6542 53.5078 5.9410 8.8419 0.0757 0.1018 50.3598 55.6120 12.4078 31.7789 44.0249 15.1742 49.0474 1.8741 13.7829 0.4342 0.0957 2.4150 0.4351 2.7671 4.2418 0.1544 0.1223 0.2041 0.0601 0.1112 0.0674 7.7049 4.3865 4.4391 5.0340 8.9883 3.9012 17.1970 9.6641 0.1341 0.0474 1.5252 1.9081 2.2126 6.8662 9.9520 4.0461 0.4365 0.8729 9.9420 0.7348 0.5492 6.1235 6.2925 10.5698 8.7256 18.9629 7.2196 1.0022 1.1205 0.5264 1.0977 26.6292 15.1765 3.9411 30.0521 5.7842 2.2018 3.0937 0.8289 0.5375 17.3232 17.4859 26.8848 0.6552 24.8373 27.4933 22.7919
temp: 298.150 k
press: 1.00000 atm
elementType: 16 16 8 8 6 6 6 6 6 6 6 6 6 6 6 6 6 6 6 1 1 1 1 1 1 1 1 1 1 1 1 1 1 1 1
symmnumber: 1
zpe: 703147.3 jmol-1
zpe.correction: 0.267815 hartree
zpe.thermalcorrener: 0.287409 hartree
zpe.thermalcorrenthalpy: 0.288354 hartree
zpe.thermalcorrgfe: 0.215123 hartree
zpe.sumelectzpe: -1526.223406 hartree
zpe.sumelectthermal: -1526.203812 hartree
zpe.sumelectthermalent: -1526.202867 hartree
zpe.sumelectthermalfe: -1526.276098 hartree
dipole: -4.3458 -0.5885 0.4012
dipole: 4.4038
quadrupole: -108.5598 -129.9026 -128.3376
quadrupole: -15.3053 2.2904 1.0447
quadrupole: 13.7069 -7.6359 -6.0709 -15.3053 2.2904 1.0447
hfenergy: -1526.491221 hartree
pointgroup: C01 [X(C15H16O2S2)]
dipole: -1.6994821 0.3365672 0.0174082 debye
polarizability: 358.3996561|-2.4105727|187.8623304|-13.5526307|50.1421191|152.229701 unknown
InChI: InChI=1S/C15H16O2S2/c16-18(11-14-7-3-1-4-8-14)13-19(17)12-15-9-5-2-6-10-15/h1-10H,11-13H2
charge 0 multiplicity 1
35 atoms
S  1.833731 -2.007593 -0.562569
S  -1.187302 -1.070443 0.083626
O  2.554567 -2.85467 -1.815548
O  -0.507664 0.447206 0.331014
C  -0.002642 -1.90511 -1.19815
C  2.272854 -0.100504 -0.967691
C  -2.652085 -0.668802 -1.239732
C  3.576285 0.254371 -0.332808
C  -3.809935 -0.057886 -0.524279
C  4.806064 -0.13453 -0.931688
C  -3.748079 1.296322 -0.092964
C  3.600274 0.967203 0.896881
C  -4.973689 -0.822629 -0.240063
C  6.033477 0.191775 -0.316369
C  -4.834728 1.871923 0.598657
C  4.829568 1.295175 1.508649
C  -6.061374 -0.242106 0.44712
C  6.049009 0.908992 0.903576
C  -5.994706 1.10734 0.867294
H  0.005718 -1.319898 -2.131824
H  -0.31527 -2.949121 -1.353579
H  1.399012 0.446292 -0.568537
H  2.294884 -0.136731 -2.069694
H  -2.875414 -1.635643 -1.718504
H  -2.119461 0.016914 -1.917826
H  4.790824 -0.698927 -1.871027
H  -2.842138 1.880323 -0.287616
H  2.653409 1.265985 1.362597
H  -5.029491 -1.868939 -0.565627
H  6.976253 -0.113028 -0.784138
H  -4.77786 2.914683 0.92928
H  4.838478 1.851578 2.452571
H  -6.957899 -0.837078 0.653027
H  7.002908 1.165163 1.378279
H  -6.839481 1.558493 1.399462
