program: Gaussian 09
title: 000264844
version: EM64L-G09RevD.01
frameworkgroup: C1[X(C15H21NO)]
method: RPBEPBE
basis: SDD
operation: Freq
keyword: #p
keyword: freq=noraman
keyword: PBEPBE/SDD
title: #p freq=noraman PBEPBE/SDD
converged: YES YES NO NO
title: Mulliken charges:
elementType: O N C C C C C C C C C C C C C C C H H H H H H H H H H H H H H H H H H H H H
charge: -0.313613 -0.162357 0.352421 -0.056433 -0.425955 -0.453857 -0.400595 -0.426432 -0.196240 -0.743295 -0.749351 0.466556 -0.434587 -0.392524 -0.228069 -0.225462 -0.242269 0.212545 0.210762 0.215420 0.207355 0.235066 0.200828 0.198497 0.215696 0.201168 0.222250 0.229209 0.204248 0.242806 0.219228 0.232618 0.217922 0.230512 0.262381 0.223849 0.223116 0.226587
chargesum: 0.00000
title: Mulliken charges with hydrogens summed into heavy atoms:
elementType: O N C C C C C C C C C C C C C C C
charge: -0.313613 -0.162357 0.352421 0.156112 0.000227 -0.011436 -0.001269 -0.009567 0.026010 -0.067032 -0.079583 0.466556 -0.204075 -0.130143 -0.004220 -0.002346 -0.015682
polarizability: 2.06557446e+02 -7.96676063e+00 1.55060123e+02 9.97975813e+00 1.38110786e+01 1.30301441e+02
1716.lowfreq: -9.0592 -0.0009 -0.0008 -0.0008 5.8849 12.9430 20.1371 48.4804 67.5289
frequency: 17.6984 46.4932 67.4844 127.4791 152.6537 171.9948 176.4438 201.7156 238.2442 248.7538 258.3301 278.8677 308.3343 330.0587 354.9685 403.6831 405.1790 419.9992 459.8530 502.6198 512.6288 552.7201 574.1694 587.9268 615.7713 634.8594 687.7948 705.2792 762.9507 799.2227 805.2957 829.6278 854.5508 857.2328 861.8650 897.4112 918.4321 928.1040 942.8965 964.6576 970.9685 979.5980 989.6461 996.0801 1019.5996 1025.4775 1028.1711 1030.8108 1064.2042 1069.6284 1084.5703 1101.6929 1129.3957 1139.2640 1170.3146 1171.4991 1179.9161 1181.5210 1200.8556 1213.0020 1215.1307 1225.4556 1274.2521 1284.5670 1296.7088 1300.3641 1317.2995 1321.0268 1336.5901 1339.9685 1343.9563 1355.5611 1380.2344 1384.7810 1386.2593 1438.9562 1453.1908 1456.3250 1462.3946 1465.8638 1471.8561 1474.9155 1481.4261 1482.3370 1485.1678 1594.0005 1615.0856 2894.2586 2954.4240 2970.4324 2975.8483 2976.9545 2981.6040 2989.7298 2995.0037 3029.5607 3037.9641 3053.5299 3057.3679 3076.6218 3086.0397 3087.8082 3110.9738 3112.6501 3124.6407 3138.4675 3155.5931 3167.3504
redmass: 3.6221 4.2510 3.7549 2.5357 2.6308 1.2322 3.2946 2.3630 1.5506 1.6179 2.6383 2.7354 2.9802 3.8586 2.2509 2.8565 2.8604 3.7156 2.9935 3.5063 2.7194 2.8108 2.5979 3.4532 6.0846 4.2176 3.3137 1.8192 1.7773 3.1809 2.4985 2.8684 1.4626 1.3728 2.2737 2.4237 1.6658 2.1132 1.7192 1.6519 1.8260 1.3887 5.5531 1.3477 2.4730 2.2174 1.9546 1.8309 1.9509 2.0100 1.6450 1.9633 2.4648 2.2742 1.0587 1.2793 1.8448 1.2475 2.1080 1.9269 1.8534 2.1515 1.6816 1.2453 1.3313 1.7978 1.3264 1.3616 1.4555 1.4477 1.5626 1.2946 1.2596 1.2424 6.3992 2.1773 1.0716 1.0832 1.0551 1.0743 1.0539 1.0811 1.0527 2.1443 1.1385 6.2067 6.1698 1.0701 1.0814 1.0620 1.0635 1.0834 1.0367 1.0606 1.0374 1.0978 1.1010 1.1004 1.0940 1.0988 1.0998 1.0979 1.0874 1.1004 1.0865 1.0926 1.0964 1.0983
irintensity: 0.0188 0.8425 0.3742 0.3397 2.0115 0.1736 1.1046 1.0316 1.6424 0.6461 0.8540 0.3320 1.0629 0.2187 0.0555 0.4805 1.3141 3.3750 3.6393 3.2453 9.4862 8.1817 0.3069 12.4021 0.8056 7.7487 0.7168 48.6427 50.8965 15.4898 5.5649 7.1274 5.6074 3.4564 9.6049 1.0031 22.0103 41.5612 9.8560 5.1344 10.8867 0.2156 0.1411 0.3551 27.1737 3.6137 22.8058 18.1748 7.4201 4.9600 5.4586 53.2083 3.5103 1.1839 0.7321 7.0617 13.7892 6.1531 47.4017 16.2612 12.7253 64.8378 38.0610 5.9519 2.7702 10.0572 9.3367 5.6251 4.3360 4.0436 5.3033 2.6691 35.4878 22.0678 1.2105 10.2696 1.4804 5.8272 7.5589 6.6144 21.3769 13.0127 4.1643 15.8942 5.4998 0.7950 7.7300 51.6369 16.1269 34.3763 43.5746 28.8880 32.7179 24.8518 18.5935 51.4183 41.9008 61.3612 23.1902 54.3566 30.2260 32.1378 9.1565 19.4218 0.6096 29.8330 35.8118 12.8044
temp: 298.150 k
press: 1.00000 atm
elementType: 8 7 6 6 6 6 6 6 6 6 6 6 6 6 6 6 6 1 1 1 1 1 1 1 1 1 1 1 1 1 1 1 1 1 1 1 1 1
symmnumber: 1
zpe: 860300.2 jmol-1
zpe.correction: 0.327671 hartree
zpe.thermalcorrener: 0.343359 hartree
zpe.thermalcorrenthalpy: 0.344303 hartree
zpe.thermalcorrgfe: 0.284490 hartree
zpe.sumelectzpe: -712.866218 hartree
zpe.sumelectthermal: -712.850531 hartree
zpe.sumelectthermalent: -712.849587 hartree
zpe.sumelectthermalfe: -712.909399 hartree
dipole: 1.3707 1.1917 -1.6100
dipole: 2.4272
quadrupole: -94.3636 -99.9349 -105.1362
quadrupole: -3.1652 0.7749 4.7101
quadrupole: 5.4480 -0.1233 -5.3247 -3.1652 0.7749 4.7101
hfenergy: -713.1938894 hartree
pointgroup: C01 [X(C15H21N1O1)]
dipole: 0.5266883 0.4925409 -0.6259935 debye
polarizability: 206.9476915|-7.3130025|154.1197205|8.9108715|14.6212862|130.8515981 unknown
InChI: InChI=1S/C15H21NO/c1-12-7-6-10-15(2)16(12)11-14(17-15)13-8-4-3-5-9-13/h3-5,8-9,12,14H,6-7,10-11H2,1-2H3
charge 0 multiplicity 1
38 atoms
O  0.125387 -1.036048 1.079125
N  1.704753 0.624268 0.547121
C  1.553093 -0.863077 0.681275
C  2.936136 1.069155 -0.171469
C  1.759751 -1.604087 -0.672043
C  0.386657 1.128214 0.096882
C  3.119276 0.362056 -1.545005
C  3.071106 -1.175397 -1.376573
C  -0.56863 0.273191 0.970172
C  2.427495 -1.423104 1.810915
C  2.976859 2.603216 -0.288585
C  -1.964259 0.100627 0.394412
C  -2.964028 1.061679 0.68776
C  -2.280751 -0.980737 -0.463762
C  -4.251136 0.959443 0.113895
C  -3.569634 -1.089054 -1.032074
C  -4.557776 -0.11677 -0.751166
H  3.786411 0.759587 0.473049
H  0.899586 -1.366513 -1.327411
H  1.742113 -2.69598 -0.496995
H  0.165566 0.964061 -0.98405
H  0.277894 2.203695 0.315241
H  4.08496 0.673985 -1.988524
H  2.321691 0.689614 -2.243166
H  3.143165 -1.673597 -2.361949
H  3.950088 -1.511017 -0.789078
H  -0.626411 0.721155 1.98279
H  2.156917 -2.475636 2.003495
H  3.501844 -1.383753 1.555211
H  2.259023 -0.836586 2.72821
H  2.19761 2.979569 -0.976971
H  2.826727 3.072339 0.70009
H  3.956337 2.927965 -0.683279
H  -2.736567 1.891187 1.369841
H  -1.518189 -1.743207 -0.651089
H  -5.014646 1.710128 0.347801
H  -3.805989 -1.934493 -1.688588
H  -5.557634 -0.202082 -1.191707
