program: Gaussian 09
title: 000264853
version: EM64L-G09RevD.01
frameworkgroup: C1[X(C17H21NO4)]
method: RPBEPBE
basis: SDD
operation: Freq
keyword: #p
keyword: freq=noraman
keyword: PBEPBE/SDD
title: #p freq=noraman PBEPBE/SDD
converged: NO YES NO NO
title: Mulliken charges:
elementType: O O O O N C C C C C C C C C C C C C C C C C H H H H H H H H H H H H H H H H H H H H H
charge: -0.164978 -0.259618 -0.267632 -0.227917 -0.167426 -0.142262 -0.289954 -0.427094 -0.439775 0.140752 -0.403660 0.120943 0.238776 -0.685346 0.262800 -0.354269 -0.376284 -0.258077 -0.234707 -0.223648 -0.664763 -0.228758 0.299384 0.275646 0.253710 0.222750 0.227410 0.269059 0.256126 0.193407 0.229890 0.232914 0.216526 0.252289 0.263482 0.228339 0.239640 0.232939 0.232109 0.219798 0.249042 0.225335 0.233100
chargesum: 0.00000
title: Mulliken charges with hydrogens summed into heavy atoms:
elementType: O O O O N C C C C C C C C C C C C C C C C C
charge: -0.164978 -0.259618 -0.267632 -0.227917 -0.167426 0.157122 -0.014308 0.049366 0.056694 0.140752 0.045873 0.120943 0.238776 -0.006017 0.262800 -0.101980 -0.112802 0.209901 -0.001767 0.008462 0.029412 0.004343
polarizability: 2.68076189e+02 -1.35354396e+01 2.02854777e+02 8.24582324e+00 2.98202139e+00 1.33037946e+02
1716.lowfreq: -10.2618 -6.4389 -0.0009 -0.0008 -0.0006 6.1151 18.8825 26.5567 39.0158
frequency: 18.7179 26.5503 38.9551 43.8642 53.6347 54.1692 75.0130 81.9088 91.0660 108.0628 148.1317 150.9040 169.6356 195.7790 200.8860 222.1560 230.4236 236.1715 284.4785 301.8943 317.9342 339.8728 369.2577 398.7262 406.3293 413.4621 463.1162 471.2143 494.0587 510.6407 589.8163 613.5577 621.5572 630.3667 664.8316 694.3715 701.9050 707.5730 729.5785 776.8656 785.8878 788.5540 811.8426 821.5258 858.8413 870.2936 883.6537 917.8188 934.7343 961.0991 982.9151 984.9712 989.5322 1001.6569 1010.1809 1025.6413 1030.6364 1033.4313 1055.4448 1079.5003 1088.3140 1095.0822 1096.1238 1115.7369 1149.1742 1158.5544 1164.1151 1173.9536 1176.2005 1187.2029 1198.2426 1237.9486 1244.7429 1275.0723 1277.9072 1286.1031 1292.1997 1309.1622 1316.0078 1336.6295 1346.4466 1358.4538 1360.0994 1379.4934 1391.1347 1392.8672 1400.8011 1432.4334 1458.6369 1463.3824 1463.8854 1464.7872 1475.7502 1477.2370 1481.1499 1482.0802 1484.6731 1545.9339 1588.8964 1609.1850 1625.0251 1646.8740 2947.1661 2981.7756 2984.0292 2987.2747 2993.0143 3009.7219 3035.1792 3044.9477 3059.0698 3075.1667 3083.5171 3087.4594 3087.9982 3095.3360 3100.9890 3122.4889 3125.0600 3133.4817 3145.2844 3156.6713 3169.0071
redmass: 4.3421 4.7461 4.7205 3.2166 4.8149 2.9701 2.8780 4.1211 4.8684 4.6844 3.4785 3.0407 2.7881 2.5542 3.8338 2.1055 2.1204 1.9006 4.9469 2.6464 2.8069 3.9606 4.8847 3.5436 3.3404 3.5312 3.9281 3.5605 4.4543 5.5103 4.2008 6.4097 6.4448 4.4843 4.7546 5.7654 2.8621 1.5629 3.0651 3.8352 1.4855 2.1856 1.3127 2.8605 1.2704 2.1491 2.1217 3.0914 1.4707 2.4866 1.3985 2.7827 5.9017 1.3393 2.2575 2.2089 1.9236 1.8941 3.0655 1.7188 2.3776 2.1496 2.1713 2.3373 2.8480 1.7333 2.6604 1.0649 1.7426 1.1159 3.2086 1.4629 1.4517 1.5088 1.1203 1.4810 1.4680 1.3117 1.3266 1.5253 1.5227 1.3463 1.3547 8.5323 1.2382 1.9149 1.3289 2.2200 1.0918 1.0796 1.0513 1.0818 1.0996 1.3901 1.2957 1.1765 1.0521 9.5079 6.2858 6.0626 10.0038 10.0393 1.0720 1.0724 1.0689 1.0377 1.0360 1.0607 1.0597 1.0938 1.0895 1.1031 1.0996 1.1006 1.0974 1.1027 1.0901 1.1069 1.0857 1.0879 1.0924 1.0961 1.1012
irintensity: 0.3014 1.1867 0.7219 1.7811 0.1557 0.9181 1.3555 1.6633 3.0338 0.2394 2.6327 1.1138 2.6377 1.5837 2.8489 1.1760 1.4427 1.4521 2.7652 9.9456 8.1000 6.5615 10.9706 2.1606 1.0360 2.4417 2.7801 0.3915 13.5235 25.8081 2.0711 0.3554 6.5281 2.8964 6.6842 5.6737 12.8331 80.7382 0.8487 2.2920 15.5845 43.6521 2.0100 11.5787 4.7119 13.4605 16.9067 5.2529 6.6815 41.9284 0.6535 48.7557 0.5617 0.1939 90.3135 6.4518 12.5558 17.2085 6.7393 17.0200 2.8093 8.9846 27.5484 264.9909 32.9547 34.0666 39.7672 0.3877 6.6491 4.6482 0.8494 2.1208 15.7268 161.7419 0.2702 133.4009 79.2197 10.6351 2.5679 68.0456 4.3707 5.8813 16.9080 0.7270 25.0863 86.5289 61.6954 9.7964 12.3559 13.6656 8.4609 6.9627 10.5500 2.9091 9.4919 11.5039 12.7315 184.1211 9.3293 3.0276 148.6082 139.5062 37.9506 20.0046 18.3381 23.3229 20.6621 18.4843 23.5855 6.6500 3.0650 20.4632 32.7830 36.6855 34.2477 2.7621 8.2592 29.2357 2.8636 2.0057 19.7223 21.1266 20.8797
temp: 298.150 k
press: 1.00000 atm
elementType: 8 8 8 8 7 6 6 6 6 6 6 6 6 6 6 6 6 6 6 6 6 6 1 1 1 1 1 1 1 1 1 1 1 1 1 1 1 1 1 1 1 1 1
symmnumber: 1
zpe: 917583.2 jmol-1
zpe.correction: 0.349489 hartree
zpe.thermalcorrener: 0.371596 hartree
zpe.thermalcorrenthalpy: 0.372540 hartree
zpe.thermalcorrgfe: 0.295413 hartree
zpe.sumelectzpe: -1014.421676 hartree
zpe.sumelectthermal: -1014.399568 hartree
zpe.sumelectthermalent: -1014.398624 hartree
zpe.sumelectthermalfe: -1014.475752 hartree
dipole: -0.7666 -2.2825 4.9961
dipole: 5.5460
quadrupole: -110.8704 -130.8498 -135.4473
quadrupole: -8.4149 0.4203 4.6303
quadrupole: 14.8521 -5.1273 -9.7248 -8.4149 0.4203 4.6303
hfenergy: -1014.7711646 hartree
pointgroup: C01 [X(C17H21N1O4)]
dipole: -0.2627953 1.1808282 -1.8159377 debye
polarizability: 268.7924404|12.9038048|199.8742633|-5.0728776|13.1133136|135.3022086 unknown
InChI: InChI=1S/C17H21NO4/c1-3-14-15(19)13(17(21)22-4-2)10-11-18(14)16(20)12-8-6-5-7-9-12/h5-9,13-14H,3-4,10-11H2,1-2H3
charge 0 multiplicity 1
43 atoms
O  -2.260278 -1.342424 1.265801
O  -4.312846 0.513211 -0.316039
O  2.416557 -2.111702 0.481215
O  -3.082953 1.986144 1.017358
N  0.853819 -0.554283 -0.262123
C  -0.217647 -1.564097 -0.039971
C  -1.929304 0.378778 -0.460545
C  -0.720544 1.340622 -0.610464
C  0.509873 0.584769 -1.14194
C  -1.532728 -0.874152 0.357806
C  -0.415448 -2.502644 -1.274846
C  2.154645 -0.923132 0.10319
C  -3.135207 1.066545 0.170316
C  -1.427465 -3.63789 -1.018145
C  3.232904 0.13032 0.090315
C  3.036522 1.422211 0.645298
C  4.5194 -0.23512 -0.380733
C  -5.589291 0.999915 0.301003
C  4.106999 2.341231 0.705721
C  5.583656 0.690299 -0.336972
C  -6.108044 2.239562 -0.431989
C  5.379768 1.982034 0.204069
H  0.099791 -2.196012 0.807526
H  -2.230196 0.007246 -1.462097
H  -0.50323 1.801373 0.369547
H  -0.984222 2.155938 -1.309195
H  0.301056 0.207695 -2.166554
H  1.376545 1.256859 -1.217388
H  0.579718 -2.930594 -1.495236
H  -0.724298 -1.912642 -2.160789
H  -1.119006 -4.250744 -0.15205
H  -2.441252 -3.253327 -0.8074
H  -1.490995 -4.301942 -1.898785
H  2.060179 1.693756 1.063552
H  4.672422 -1.250292 -0.761458
H  -6.267944 0.138788 0.196745
H  -5.399809 1.209232 1.367945
H  3.950613 3.32997 1.150818
H  6.571863 0.403061 -0.712392
H  -7.091944 2.529772 -0.018892
H  -5.417406 3.089587 -0.302748
H  -6.233655 2.037992 -1.50992
H  6.208685 2.697287 0.246944
