program: Gaussian 09
title: 000264855
version: EM64L-G09RevD.01
frameworkgroup: C1[X(C18H16Br2O2)]
method: RPBEPBE
basis: SDD
operation: Freq
keyword: #p
keyword: freq=noraman
keyword: PBEPBE/SDD
title: #p freq=noraman PBEPBE/SDD
converged: YES YES NO NO
title: Mulliken charges:
elementType: Br Br O O C C C C C C C C C C C C C C C C C C H H H H H H H H H H H H H H H H
charge: 0.030302 0.030343 -0.220543 -0.220379 -0.386664 -0.387101 -0.539389 -0.539439 0.117322 0.116958 0.315281 0.315403 -0.339666 -0.339340 -0.346728 -0.346828 -0.200430 -0.200430 -0.187642 -0.187662 -0.209348 -0.209303 0.245273 0.217546 0.244906 0.217883 0.237748 0.221108 0.221375 0.237542 0.249026 0.249068 0.284627 0.284533 0.255480 0.255491 0.256826 0.256852
chargesum: 0.00000
title: Mulliken charges with hydrogens summed into heavy atoms:
elementType: Br Br O O C C C C C C C C C C C C C C C C C C
charge: 0.030302 0.030343 -0.220543 -0.220379 0.076155 0.075688 -0.080533 -0.080522 0.117322 0.116958 0.315281 0.315403 -0.090640 -0.090272 -0.062100 -0.062296 0.055050 0.055062 0.069184 0.069189 -0.209348 -0.209303
polarizability: 1.78411043e+02 5.63239182e-01 3.09934066e+02 -4.71722043e+01 1.70307186e-01 2.00176398e+02
1716.lowfreq: -9.4738 -8.2284 -0.0006 -0.0005 0.0005 4.2589 5.1249 6.4674 14.3354
frequency: -6.2669 6.1002 13.9742 41.9571 49.6948 51.6709 74.7470 75.9424 98.4890 127.7670 144.0140 176.1489 180.0257 222.6519 233.5642 251.1228 253.2471 276.9464 292.7674 292.9550 403.1939 405.5484 417.6147 421.4230 431.0378 473.6984 478.6791 489.6452 496.3923 569.1008 570.6147 620.9272 621.0199 673.4459 674.5474 718.0125 725.5624 733.0040 742.1533 797.2729 813.1424 829.9269 835.6536 852.3914 861.6678 914.1464 919.4646 964.5166 965.2317 983.1179 994.2393 996.5040 996.8464 999.8382 1017.4057 1032.2480 1057.2234 1058.1365 1079.1971 1083.1941 1111.5268 1112.4212 1139.6952 1141.2159 1186.3651 1187.5149 1212.2086 1253.5717 1278.8148 1279.7365 1293.2538 1293.3927 1308.5352 1313.2113 1321.1055 1361.1107 1367.2738 1370.7905 1392.7370 1393.1225 1458.8162 1460.7510 1461.0089 1470.7155 1475.5968 1476.7613 1553.3078 1553.7446 1582.3779 1582.6718 1598.0020 1598.3365 2983.3245 2989.7891 3005.6723 3006.7531 3031.9293 3056.3432 3072.3175 3074.3070 3151.8978 3152.1917 3153.0835 3153.1897 3173.2566 3173.3522 3176.7483 3176.8257
redmass: 7.1830 23.4914 12.4740 3.7884 4.3261 6.7593 9.3011 10.3785 2.8012 5.0298 4.8562 5.5438 3.8315 6.1943 7.6657 7.0134 8.6003 4.2191 3.7931 3.6156 3.1356 2.8776 4.2830 3.0866 2.7897 3.7969 3.8818 4.8746 3.9216 3.7197 3.6952 7.0830 7.1004 2.5276 3.9047 3.3197 5.6052 3.2790 3.0963 1.6829 1.9550 1.3522 1.3867 1.4146 1.7198 1.9244 2.2780 1.3681 1.3920 3.1375 4.7058 1.4985 1.4175 2.6849 3.4729 2.3425 3.0329 2.8643 2.1336 2.6537 1.3602 1.3751 1.3910 1.2638 1.1277 1.1285 1.3749 2.0761 2.4344 1.5626 1.2490 1.2517 1.3520 1.1264 1.4803 2.0079 5.0309 2.7594 4.0971 3.9269 1.0964 1.4782 1.5913 1.0989 1.4862 1.4376 8.1372 8.0887 6.8772 6.8170 7.5119 7.5919 1.0602 1.0606 1.0607 1.0601 1.0985 1.1039 1.1021 1.1023 1.0881 1.0881 1.0889 1.0888 1.0960 1.0960 1.0973 1.0972
irintensity: 0.3991 0.1292 0.6994 0.3250 0.0104 0.1259 4.5337 0.5365 5.4317 2.0870 3.9538 0.7390 1.1388 1.2025 1.1003 0.3592 0.2218 0.0111 6.3983 3.1771 1.2492 0.0694 6.2749 2.6192 4.3774 37.5711 5.3407 10.3134 13.9216 2.9526 0.3601 1.1352 1.2129 4.0845 14.5800 4.8570 9.8533 17.5824 22.4197 23.4028 17.8685 50.1227 1.0193 75.9071 9.8945 1.0681 22.8958 0.4230 0.5872 126.9336 37.6082 4.7452 3.3227 6.9678 18.9320 1.8128 29.6913 55.5526 1.8647 8.2473 5.5464 12.2106 41.2985 29.0870 8.7863 11.5189 2.4404 55.4910 233.5459 42.4493 0.7748 1.9615 12.7265 0.3819 29.2027 0.4320 7.3541 19.6324 11.4852 30.6054 6.5842 52.7400 10.4930 7.7492 2.2451 13.6617 77.8733 158.4740 102.7761 148.5135 49.3786 35.3776 2.3062 30.3128 30.2464 15.7188 1.7974 39.7936 27.8560 51.7716 4.6437 5.3924 0.2232 0.2310 6.8864 6.7601 0.9843 1.1841
temp: 298.150 k
press: 1.00000 atm
elementType: 35 35 8 8 6 6 6 6 6 6 6 6 6 6 6 6 6 6 6 6 6 6 1 1 1 1 1 1 1 1 1 1 1 1 1 1 1 1
symmnumber: 1
zpe: 757842.9 jmol-1
zpe.correction: 0.288647 hartree
zpe.thermalcorrener: 0.309008 hartree
zpe.thermalcorrenthalpy: 0.309952 hartree
zpe.thermalcorrgfe: 0.233959 hartree
zpe.sumelectzpe: -871.310368 hartree
zpe.sumelectthermal: -871.290007 hartree
zpe.sumelectthermalent: -871.289063 hartree
zpe.sumelectthermalfe: -871.365056 hartree
dipole: -0.0080 1.6674 -0.0083
dipole: 1.6675
quadrupole: -146.9804 -139.0655 -158.6113
quadrupole: -0.0258 -8.5403 -0.0343
quadrupole: 1.2387 9.1536 -10.3922 -0.0258 -8.5403 -0.0343
hfenergy: -871.5990154 hartree
pointgroup: C01 [X(C18H16Br2O2)]
dipole: -0.6291253 -0.1859362 -0.0010348 debye
polarizability: 298.4108945|40.5112923|167.5431436|9.5838778|-33.8324243|222.5674687 unknown
InChI: InChI=1S/C18H16Br2O2/c19-15-9-5-13(6-10-15)17(21)3-1-2-4-18(22)14-7-11-16(20)12-8-14/h5-12H,1-4H2
charge 0 multiplicity 1
38 atoms
Br 2.464721 4.940672 -1.776935
Br 4.712309 -2.896924 1.77566
O  -2.111603 1.549091 2.249282
O  -0.967824 -2.416455 -2.24644
C  -2.908614 -0.225195 -0.50293
C  -2.579539 -1.345026 0.50923
C  -3.314573 1.114629 0.186127
C  -2.215829 -2.695497 -0.182795
C  -2.167944 1.720768 0.993158
C  -0.923258 -2.598983 -0.991418
C  -1.081306 2.485073 0.285946
C  0.40384 -2.676479 -0.285786
C  -1.092522 2.732898 -1.113052
C  0.525633 -2.897796 1.112496
C  0.003206 2.981302 1.060251
C  1.586698 -2.52132 -1.059652
C  -0.049374 3.457601 -1.72795
C  1.794284 -2.963561 1.726806
C  1.051394 3.706292 0.46335
C  2.859875 -2.584572 -0.463189
C  1.011552 3.935593 -0.930442
C  2.947454 -2.805939 0.929699
H  -2.050056 -0.060451 -1.180622
H  -3.750683 -0.552099 -1.143773
H  -1.757694 -1.02576 1.177375
H  -3.459473 -1.515898 1.159716
H  -4.145452 0.925261 0.888922
H  -3.674001 1.82329 -0.582912
H  -2.143975 -3.489322 0.583394
H  -3.022187 -2.973082 -0.884974
H  -1.912302 2.366881 -1.738782
H  -0.363562 -3.021976 1.738285
H  0.000359 2.784886 2.137438
H  1.480431 -2.352281 -2.136258
H  -0.061836 3.645186 -2.805056
H  1.883122 -3.132753 2.803333
H  1.881917 4.086004 1.06485
H  3.765511 -2.465161 -1.064255
