program: Gaussian 09
title: 000264836
version: EM64L-G09RevD.01
frameworkgroup: C1[X(C14H20O)]
method: RPBEPBE
basis: SDD
operation: Freq
keyword: #pfreq=noraman
keyword: PBEPBE/SDD
title: #p freq=noraman PBEPBE/SDD
converged: YES YES NO NO
title: Mulliken charges:
elementType: O C C C C C C C C C C C C C C H H H H H H H H H H H H H H H H H H H H
charge: -0.201987 0.081098 0.145748 0.124839 -0.155508 0.005874 0.403661 0.396704 -0.706741 -0.811909 -0.830423 -0.709156 -0.702688 -0.826325 -0.831673 0.243411 0.235712 0.258405 0.213106 0.236274 0.247342 0.230558 0.230759 0.227354 0.231840 0.223028 0.211355 0.212388 0.245962 0.225584 0.231315 0.227844 0.228983 0.233210 0.224056
chargesum: 0.00000
title: Mulliken charges with hydrogens summed into heavy atoms:
elementType: O C C C C C C C C C C C C C C
charge: -0.201987 0.081098 0.145748 0.124839 0.087903 0.005874 0.403661 0.396704 -0.471029 -0.104124 -0.121764 -0.026934 -0.032984 -0.141582 -0.145423
polarizability: 1.84114044e+02 9.71924972e-01 1.74430653e+02 -7.48298843e+00 1.98393325e+00 1.06003849e+02
1716.lowfreq: -5.3973 -0.0011 -0.0008 0.0002 7.8226 12.4282 38.4866 57.2834 70.6024
frequency: 38.3969 57.2407 70.5884 96.9789 119.1271 136.4691 140.0398 156.6939 169.0786 187.4211 192.7017 209.4384 233.2621 246.7503 272.5499 293.0124 303.6020 334.4546 339.9683 350.5181 386.5587 405.2256 435.6469 502.8089 518.1142 588.4720 591.6378 655.1522 676.6688 716.3693 765.6006 808.8140 844.0221 878.7724 884.7008 923.7763 959.9374 967.8833 994.6178 1013.6643 1020.7966 1025.6984 1035.3466 1051.2557 1053.1102 1081.4782 1085.2197 1097.1060 1114.0620 1174.0971 1231.4891 1244.4302 1289.5676 1305.2904 1337.0555 1353.0288 1370.8769 1387.6805 1392.5495 1395.2104 1397.2348 1407.9546 1408.8399 1446.4181 1460.5500 1460.8320 1462.4598 1468.2358 1470.6332 1475.5143 1476.1381 1477.4203 1481.0274 1484.7423 1489.8514 1492.6534 1576.8543 1592.5646 1609.9167 2967.7511 2969.2984 2970.2695 2976.8740 2979.4216 2983.1641 3019.4133 3039.6608 3040.1284 3044.2757 3045.4099 3074.0074 3080.2925 3082.0231 3082.3583 3083.4343 3094.4789 3095.1153 3112.4879 3123.0889
redmass: 3.4826 2.6420 3.2972 1.4553 1.7177 1.3126 1.6024 2.3474 1.1297 1.0932 1.6042 2.2861 1.1779 3.1477 2.7755 2.9347 2.7970 2.5434 2.8645 2.8375 3.8317 2.7952 4.8066 4.5340 3.0350 3.3659 3.4640 3.4427 3.4718 4.1896 3.8778 4.6806 3.2280 2.6628 1.3133 1.1728 1.4062 1.9678 1.3223 1.4870 1.4180 1.4817 2.2597 1.6113 1.6828 2.0520 2.5844 1.9672 2.5366 1.9931 5.2146 1.4224 1.4030 3.5878 1.8094 6.1958 1.2170 1.6013 1.7816 1.2297 1.3888 1.2205 1.1923 2.1348 1.0893 1.0694 1.0472 1.1781 1.1484 1.0787 1.0663 1.0943 1.1670 1.1047 1.0587 1.0714 6.0905 8.2360 6.4561 1.0382 1.0379 1.0411 1.0411 1.0339 1.0359 1.0840 1.0963 1.0966 1.0966 1.0949 1.0996 1.0999 1.0982 1.0984 1.1009 1.0982 1.0979 1.0911 1.0943
irintensity: 1.3084 1.2831 0.9943 0.3698 0.2497 1.1387 3.7451 1.4168 0.1129 0.5731 0.5143 1.4690 0.5647 0.4342 1.7589 5.0179 0.0720 1.3672 0.3400 1.5263 0.9530 6.6247 0.0549 1.5000 1.3783 1.5058 1.3561 0.6923 3.2063 1.4472 2.5765 7.9056 2.1008 3.2596 8.9508 3.6843 9.1058 46.3801 3.5920 22.2096 0.8856 15.7491 1.4129 1.4515 4.2091 26.7538 6.2098 4.4491 20.8191 0.9730 18.6876 1.0330 4.7289 18.0203 16.1613 1.4466 15.4528 0.9701 62.8792 1.7943 1.6383 28.5009 13.2952 10.6232 2.6487 1.0782 6.5584 10.5697 7.7855 9.3207 12.8878 19.2668 28.7978 30.5494 8.8079 14.2847 8.9944 106.9427 6.1975 69.3904 33.1823 13.8792 21.8905 32.0775 31.3439 12.7620 17.3592 58.0614 1.1958 5.4159 29.7055 41.8628 11.0139 31.3331 20.5956 36.9304 8.4884 27.1567 10.5447
temp: 298.150 k
press: 1.00000 atm
elementType: 8 6 6 6 6 6 6 6 6 6 6 6 6 6 6 1 1 1 1 1 1 1 1 1 1 1 1 1 1 1 1 1 1 1 1
symmnumber: 1
zpe: 786633.7 jmol-1
zpe.correction: 0.299613 hartree
zpe.thermalcorrener: 0.317107 hartree
zpe.thermalcorrenthalpy: 0.318051 hartree
zpe.thermalcorrgfe: 0.255242 hartree
zpe.sumelectzpe: -619.579324 hartree
zpe.sumelectthermal: -619.561830 hartree
zpe.sumelectthermalent: -619.560886 hartree
zpe.sumelectthermalfe: -619.623695 hartree
dipole: -1.4048 1.1863 2.5167
dipole: 3.1168
quadrupole: -87.9652 -84.1505 -97.9444
quadrupole: 2.7414 5.0514 -2.4009
quadrupole: 2.0548 5.8696 -7.9244 2.7414 5.0514 -2.4009
hfenergy: -619.878937 hartree
pointgroup: C01 [X(C14H20O1)]
dipole: -0.5826654 -0.2813178 -1.041662 debye
polarizability: 183.5391318|-3.0489958|173.4443566|8.5856156|9.4016929|107.565057 unknown
InChI: InChI=1S/C14H20O/c1-8(2)14(15)13-11(5)9(3)7-10(4)12(13)6/h7-8H,1-6H3
charge 0 multiplicity 1
35 atoms
O  2.100058 0.464984 1.630838
C  0.124716 0.078627 0.268654
C  -0.576824 1.323196 0.30843
C  -0.547485 -1.148687 -0.018347
C  2.545729 -0.365593 -0.620513
C  1.615658 0.057444 0.536623
C  -1.970955 1.332903 0.006832
C  -1.940892 -1.124081 -0.309026
C  -2.619338 0.116048 -0.300945
C  0.108807 2.63977 0.63895
C  0.171901 -2.490221 0.037665
C  2.887739 0.926137 -1.423601
C  3.825546 -1.058091 -0.106833
C  -2.762113 2.629282 0.016236
C  -2.703332 -2.403046 -0.609569
H  1.986851 -1.038441 -1.296845
H  -3.692554 0.132181 -0.529799
H  1.196542 2.537844 0.757855
H  -0.090891 3.397399 -0.142756
H  -0.279691 3.053458 1.589661
H  1.16992 -2.417954 0.498265
H  0.291912 -2.935201 -0.970121
H  -0.408139 -3.216979 0.636069
H  3.461347 1.629653 -0.793252
H  1.976498 1.438281 -1.782261
H  3.50427 0.666608 -2.303099
H  4.524276 -1.25124 -0.940906
H  3.597497 -2.023965 0.380826
H  4.329089 -0.418941 0.638901
H  -2.393912 3.341007 -0.748183
H  -3.83064 2.443314 -0.1857
H  -2.686062 3.146602 0.991477
H  -2.731994 -3.079311 0.267363
H  -3.746256 -2.183238 -0.894253
H  -2.239879 -2.974547 -1.436034
