program: Gaussian 09
title: 000264832
version: EM64L-G09RevD.01
frameworkgroup: C1[X(C13H19NO)]
method: RPBEPBE
basis: SDD
operation: Freq
keyword: #p
keyword: freq=noraman
keyword: PBEPBE/SDD
title: #p freq=noraman PBEPBE/SDD
converged: YES YES NO NO
title: Mulliken charges:
elementType: O N C C C C C C C C C C C C C H H H H H H H H H H H H H H H H H H H
charge: -0.439144 -0.068389 -0.218343 -0.440356 -0.443562 -0.391020 -0.384301 0.545193 -0.343777 -0.324662 -0.473560 -0.400246 -0.222228 -0.250549 -0.247074 0.202700 0.209200 0.212555 0.214468 0.209157 0.218730 0.172189 0.174694 0.208701 0.167892 0.224978 0.232840 0.188533 0.231154 0.230995 0.223267 0.222652 0.227178 0.330138
chargesum: 0.00000
title: Mulliken charges with hydrogens summed into heavy atoms:
elementType: O N C C C C C C C C C C C C C
charge: -0.109006 -0.068389 -0.015644 -0.018602 -0.019936 -0.000102 -0.000907 0.545193 0.049093 0.096711 -0.242406 -0.169251 0.001039 -0.027897 -0.019896
polarizability: 2.02599599e+02 -4.46482524e+00 1.28546411e+02 1.12714928e+00 1.23184221e+01 1.08213500e+02
1716.lowfreq: -7.7529 -6.6095 -0.0006 0.0002 0.0004 3.7553 30.3231 36.6523 69.8731
frequency: 29.8660 36.0991 69.7905 79.8389 95.5244 125.8548 205.3347 216.8854 239.6127 270.8739 289.7384 319.6814 355.7633 362.7776 391.5698 403.3325 461.7068 470.4518 534.8575 557.4574 616.8499 639.2669 705.2352 759.9880 769.1179 794.0592 803.9411 808.8411 850.2473 883.1572 906.3462 934.5540 957.5956 971.9621 981.2611 987.4237 991.2655 992.7198 1026.2558 1035.1998 1046.1171 1065.3768 1070.4484 1101.0156 1106.6962 1130.2467 1135.9552 1158.3612 1170.9440 1187.8079 1195.0852 1206.4672 1248.6996 1255.2273 1269.6710 1289.1706 1298.0082 1300.3370 1309.6146 1327.4642 1336.4950 1337.5454 1350.6381 1360.8807 1370.2826 1384.4628 1393.6156 1441.8128 1448.5446 1456.0617 1458.2583 1467.1029 1475.1536 1479.8705 1482.8939 1591.8167 1613.0688 2813.9434 2815.3225 2833.8084 2953.7436 2968.9627 2989.4945 2992.3939 3026.4823 3034.7067 3039.9912 3052.0988 3057.8337 3102.8623 3112.1580 3115.2636 3130.4844 3141.2322 3160.5142 3555.2225
redmass: 4.1298 4.6224 2.6944 2.6388 3.3696 3.6123 3.8653 2.8312 2.2654 3.2504 2.0720 1.3317 2.9525 2.4832 3.3593 2.8027 2.9326 2.3452 3.0038 3.4166 6.3985 3.5733 1.6649 3.4986 1.9664 1.4079 2.0599 1.4224 1.2482 3.0945 1.5597 1.7363 3.7122 1.3996 1.5725 2.8442 4.2710 1.3153 2.3660 2.4227 1.7953 2.4161 1.7580 2.0728 2.4644 1.8776 2.1838 1.2561 1.0559 1.1115 1.5126 1.9072 1.4415 1.7532 1.3508 1.1263 1.3260 1.3558 1.3689 1.2970 1.3395 1.2917 1.2711 1.5689 1.3843 4.7732 1.4262 2.1313 1.0898 1.0866 1.0939 1.0740 1.1098 1.0970 2.2132 5.9670 6.1545 1.0719 1.0707 1.0701 1.0830 1.0688 1.0594 1.0608 1.0868 1.0870 1.0862 1.1031 1.1027 1.0965 1.0867 1.0865 1.0907 1.0958 1.1014 1.0661
irintensity: 0.3331 0.3606 2.8055 2.0290 2.4513 2.0857 0.4112 1.1393 1.2673 1.2969 29.1952 116.4060 4.8937 25.6067 5.3479 0.0082 2.7754 0.4033 14.4432 2.9785 0.0730 0.7186 54.1105 6.3683 43.3979 4.5680 1.6063 1.1866 0.0065 2.2972 1.7290 0.9166 114.2392 1.0093 21.7075 30.4358 18.3838 0.1691 1.2738 2.6553 8.7171 22.5748 13.6089 11.2645 2.4351 13.9670 15.9789 4.7337 0.0457 0.2198 2.7527 2.2372 15.0153 7.7953 7.6608 8.3576 7.5508 1.8410 6.7008 12.3127 0.5023 38.9132 13.2395 1.2305 2.5069 0.0644 2.6353 6.5127 5.6225 7.4086 5.4196 0.9880 11.1021 11.3374 17.8963 1.7887 11.8759 39.4679 54.9434 238.3465 23.9804 57.0777 26.1452 26.3172 42.0389 33.2887 46.4026 15.9390 52.1330 27.4528 10.1575 7.4786 11.4736 47.1184 26.6661 7.9795
temp: 298.150 k
press: 1.00000 atm
elementType: 8 7 6 6 6 6 6 6 6 6 6 6 6 6 6 1 1 1 1 1 1 1 1 1 1 1 1 1 1 1 1 1 1 1
symmnumber: 1
zpe: 772488.8 jmol-1
zpe.correction: 0.294225 hartree
zpe.thermalcorrener: 0.308703 hartree
zpe.thermalcorrenthalpy: 0.309647 hartree
zpe.thermalcorrgfe: 0.251633 hartree
zpe.sumelectzpe: -635.581103 hartree
zpe.sumelectthermal: -635.566626 hartree
zpe.sumelectthermalent: -635.565682 hartree
zpe.sumelectthermalfe: -635.623695 hartree
dipole: -1.1670 -1.6539 -1.3881
dipole: 2.4544
quadrupole: -101.7179 -88.4073 -90.5180
quadrupole: -8.4125 -7.3347 2.4741
quadrupole: -8.1702 5.1404 3.0297 -8.4125 -7.3347 2.4741
hfenergy: -635.8753288 hartree
pointgroup: C01 [X(C13H19N1O1)]
dipole: 0.4574509 -0.420561 0.739139 debye
polarizability: 202.6433294|4.1354919|117.9265792|-0.6397107|-15.9663204|118.7896017 unknown
InChI: InChI=1S/C13H19NO/c15-11-10-14-8-6-13(7-9-14)12-4-2-1-3-5-12/h1-5,13,15H,6-11H2
charge 0 multiplicity 1
34 atoms
O  -6.070273 0.644227 -0.153232
N  -2.364912 -0.216449 -0.130643
C  0.539525 -0.503763 0.39065
C  -0.149483 -1.083679 -0.875624
C  -0.288944 0.709385 0.900607
C  -1.628834 -1.417046 -0.600618
C  -1.76499 0.321691 1.115118
C  2.004728 -0.147095 0.152388
C  -3.825403 -0.429983 -0.026431
C  -4.61879 0.876678 -0.239821
C  3.034894 -0.773013 0.899553
C  2.374234 0.82277 -0.818063
C  4.393937 -0.44433 0.688362
C  3.729533 1.154666 -1.033421
C  4.746903 0.522231 -0.280245
H  0.50032 -1.28691 1.178228
H  0.382109 -1.99414 -1.212378
H  -0.09824 -0.343679 -1.696774
H  -0.23717 1.529892 0.159961
H  0.138939 1.087934 1.848636
H  -2.109441 -1.781053 -1.527544
H  -1.682292 -2.248841 0.152312
H  -1.829205 -0.433271 1.945327
H  -2.339369 1.209413 1.437191
H  -4.115353 -0.883422 0.959657
H  -4.140567 -1.145219 -0.80821
H  -4.450356 1.254028 -1.259866
H  -4.301573 1.659764 0.480445
H  2.768543 -1.524485 1.6538
H  1.597575 1.322453 -1.410148
H  5.173877 -0.940471 1.277502
H  3.994165 1.905515 -1.78697
H  5.798906 0.779947 -0.446764
H  -6.285791 0.299651 0.750518
