program: Gaussian 09
title: 000264845
version: EM64L-G09RevD.01
frameworkgroup: C1[X(C15H21NO4)]
method: RPBEPBE
basis: SDD
operation: Freq
keyword: #p
keyword: freq=noraman
keyword: PBEPBE/SDD
title: #p freq=noraman PBEPBE/SDD
converged: YES YES NO NO
title: Mulliken charges:
elementType: O O O O N C C C C C C C C C C C C C C C H H H H H H H H H H H H H H H H H H H H H
charge: -0.266956 -0.266960 -0.251149 -0.251158 -0.088006 -0.532642 -0.532568 0.225240 0.225251 -0.509682 -0.509682 -0.385654 -0.385540 -0.158654 0.256286 0.256228 -0.263263 -0.263274 -0.664915 -0.664902 0.227611 0.252554 0.252563 0.227618 0.250856 0.275693 0.275724 0.250840 0.242267 0.242250 0.238026 0.232320 0.221981 0.221984 0.232334 0.226894 0.250665 0.216147 0.250631 0.226898 0.216146
chargesum: 0.00000
title: Mulliken charges with hydrogens summed into heavy atoms:
elementType: O O O O N C C C C C C C C C C C C C C C
charge: -0.266956 -0.266960 -0.251149 -0.251158 -0.088006 -0.052478 -0.052387 0.225240 0.225251 0.016867 0.016883 -0.143388 -0.143290 0.079372 0.256286 0.256228 0.191038 0.191043 0.028791 0.028773
polarizability: 2.07230702e+02 2.13955388e-02 2.18323419e+02 -1.81504636e-02 -6.15148070e-01 1.25602290e+02
1716.lowfreq: -7.8889 -7.1492 -5.9868 -0.0004 0.0002 0.0009 6.5065 15.3919 26.6858
frequency: 4.9116 15.2536 25.8046 28.1294 35.1956 39.8188 56.2058 67.1912 76.1011 94.0608 114.7829 119.6936 158.1825 168.5154 210.5075 221.4139 226.3750 226.9129 264.8354 295.0074 315.8564 342.5447 379.8184 402.0753 433.2274 466.5377 472.9011 547.2857 561.3865 565.3148 573.2718 613.2970 654.6295 676.9199 719.5919 738.7768 765.4457 779.0314 792.0179 792.2248 817.8420 819.8500 830.4721 895.9108 905.7309 907.0849 959.9055 960.6688 993.9672 1010.6596 1011.2115 1012.9120 1032.0070 1058.9496 1064.6106 1092.6989 1095.6515 1096.2032 1122.8099 1125.3142 1152.8806 1155.3562 1156.7772 1157.2497 1173.4178 1210.1507 1241.9480 1247.0988 1255.8296 1280.0131 1280.3196 1281.7877 1308.4334 1323.5717 1352.3358 1354.8532 1364.0251 1365.4901 1393.4521 1393.7345 1404.6380 1439.7106 1446.4694 1446.8449 1456.2316 1456.3374 1459.0384 1461.1049 1464.6844 1464.8065 1485.6011 1486.0456 1572.9316 1581.0694 1637.0061 1637.7007 2992.6722 2992.7274 2993.8985 2994.2488 3000.5541 3001.0847 3027.3930 3027.4488 3048.8793 3049.2593 3071.6953 3071.9438 3087.4070 3087.5414 3091.6754 3091.7122 3117.6403 3117.7089 3132.9539 3148.3462 3164.4549
redmass: 3.0523 4.5785 5.4548 4.4388 3.4361 3.7887 2.9935 3.3324 3.4445 3.0228 2.8276 3.5203 3.1499 2.9480 3.4232 3.5360 1.4791 1.4156 3.3458 2.4733 2.8888 3.7204 3.5213 3.0604 3.4565 3.1927 3.5952 3.4827 3.1550 2.9535 5.5063 5.0898 4.6239 3.6775 4.4012 2.1004 1.2456 1.5162 1.5893 1.9634 1.7174 1.7357 2.6945 3.2465 3.4823 1.4437 5.8131 3.2125 1.3599 2.6213 2.8773 2.3320 2.2152 3.6459 4.1932 1.8228 2.1755 2.1412 2.2711 2.2863 1.4098 1.4511 1.6457 1.5345 1.1621 1.5722 1.5527 1.3041 1.3305 1.1971 1.1176 2.0262 1.9511 2.0891 1.5500 1.3596 1.7816 1.6101 1.2344 1.2347 2.3936 1.1296 1.0874 2.4284 1.0939 1.0929 1.0932 1.0980 1.0429 1.0427 1.0506 1.0506 6.9668 5.5070 8.7456 8.8425 1.0362 1.0361 1.0620 1.0620 1.0621 1.0621 1.0596 1.0596 1.0965 1.0964 1.0996 1.0996 1.0975 1.0974 1.1032 1.1032 1.1057 1.1057 1.0869 1.0929 1.1006
irintensity: 0.4369 0.2704 1.1777 0.8760 0.0916 1.6901 0.4749 2.9150 1.8308 2.2146 1.7931 1.7021 1.3148 0.2360 0.1543 4.6192 1.8924 9.9623 4.6010 7.3299 38.9186 0.2399 8.9973 0.0161 1.9648 4.7306 3.3250 4.8650 15.8102 2.3891 8.1474 0.5832 4.4965 3.5793 9.0018 8.4643 10.0078 3.1787 39.1600 10.2193 1.4508 11.5120 19.6000 3.0215 26.2007 0.0378 2.0177 1.4347 0.1491 43.8283 30.2260 22.7034 3.9962 70.6918 37.4412 28.3700 55.0465 39.4224 79.9328 389.0702 12.9775 97.7957 0.2362 0.4336 1.0962 10.1803 48.7218 56.3762 63.6063 0.3967 6.6315 13.7846 90.4819 20.2950 4.3724 0.0018 21.6524 19.6494 2.7917 43.2813 4.0516 11.2094 11.3845 116.4952 25.9291 1.0548 32.4711 14.0897 0.0084 27.0074 24.0716 3.3945 74.2794 54.2884 66.7803 232.9901 0.7198 39.5501 11.6852 0.6946 5.0267 44.8026 50.5539 17.3320 19.7664 2.1197 5.9186 25.6218 69.3077 8.8933 0.7425 0.8573 5.0545 62.7377 3.1180 20.5835 19.9554
temp: 298.150 k
press: 1.00000 atm
elementType: 8 8 8 8 7 6 6 6 6 6 6 6 6 6 6 6 6 6 6 6 1 1 1 1 1 1 1 1 1 1 1 1 1 1 1 1 1 1 1 1 1
symmnumber: 1
zpe: 882339.8 jmol-1
zpe.correction: 0.336066 hartree
zpe.thermalcorrener: 0.358052 hartree
zpe.thermalcorrenthalpy: 0.358996 hartree
zpe.thermalcorrgfe: 0.277912 hartree
zpe.sumelectzpe: -938.333352 hartree
zpe.sumelectthermal: -938.311366 hartree
zpe.sumelectthermalent: -938.310422 hartree
zpe.sumelectthermalfe: -938.391505 hartree
dipole: -0.0044 -0.0428 -2.6706
dipole: 2.6709
quadrupole: -116.6454 -92.1011 -126.5424
quadrupole: -0.0137 0.0076 -2.2642
quadrupole: -4.8824 19.6619 -14.7794 -0.0137 0.0076 -2.2642
hfenergy: -938.6694179 hartree
pointgroup: C01 [X(C15H21N1O4)]
dipole: 0.0013345 -0.1130514 -1.0447195 debye
polarizability: 207.2308245|0.0406078|217.0600171|-0.0178012|-10.766396|126.8655695 unknown
InChI: InChI=1S/C15H21NO4/c1-3-19-14(17)10-8-12-6-5-7-13(16-12)9-11-15(18)20-4-2/h5-7H,3-4,8-11H2,1-2H3
charge 0 multiplicity 1
41 atoms
O  3.73829 1.723665 -1.186471
O  -3.73873 1.740979 -1.184917
O  4.286099 0.782177 0.878346
O  -4.294669 0.796483 0.876364
N  -0.007921 -1.541944 0.351008
C  2.450844 -1.415147 0.406939
C  -2.466424 -1.40646 0.403899
C  1.173367 -2.230856 0.292075
C  -1.191594 -2.226507 0.290403
C  2.419257 -0.140618 -0.461775
C  -2.428647 -0.130317 -0.462134
C  1.205953 -3.64256 0.16199
C  -1.229114 -3.638118 0.160294
C  -0.01285 -4.351992 0.096364
C  3.570237 0.797395 -0.151233
C  -3.576862 0.811154 -0.151862
C  4.802754 2.756727 -0.990726
C  -4.798819 2.778373 -0.988477
C  4.269117 3.943542 -0.183498
C  -4.260895 3.960807 -0.177671
H  3.321669 -2.041616 0.143371
H  2.595765 -1.108987 1.461329
H  -2.612755 -1.101957 1.458587
H  -3.338813 -2.029441 0.137204
H  2.424796 -0.375339 -1.540966
H  1.467463 0.391467 -0.26742
H  -1.475354 0.398046 -0.264909
H  -2.432864 -0.362793 -1.541813
H  2.166113 -4.166039 0.111907
H  -2.191102 -4.158108 0.108892
H  -0.014774 -5.442415 -0.007474
H  5.66242 2.282467 -0.484895
H  5.075707 3.043971 -2.018809
H  -5.068893 3.069251 -2.016299
H  -5.66143 2.306916 -0.485053
H  3.374886 4.376937 -0.6640
H  4.009854 3.633421 0.842651
H  5.043203 4.730974 -0.119955
H  -4.004514 3.647001 0.848087
H  -3.363969 4.391189 -0.655849
H  -5.031402 4.751675 -0.113305
