program: Gaussian 09
title: 000264874
version: EM64L-G09RevD.01
frameworkgroup: C1[X(C24H24O2)]
method: RPBEPBE
basis: SDD
operation: Freq
keyword: #pfreq=noraman
keyword: PBEPBE/SDD
title: #p freq=noraman PBEPBE/SDD
converged: YES YES NO NO
title: Mulliken charges:
elementType: O O C C C C C C C C C C C C C C C C C C C C C C C C H H H H H H H H H H H H H H H H H H H H H H H H
charge: -0.203795 -0.203785 -0.399119 -0.399147 -0.411984 -0.411946 -0.594211 -0.594259 0.394737 0.394815 -0.085213 -0.085330 -0.404842 -0.404862 0.436768 0.436740 -0.389708 -0.389689 -0.350380 -0.350487 -0.248255 -0.248249 -0.263387 -0.263342 -0.233520 -0.233519 0.210033 0.213459 0.210032 0.213460 0.205680 0.215779 0.205686 0.215710 0.252037 0.224824 0.252033 0.224895 0.258124 0.258103 0.237131 0.237134 0.240828 0.240865 0.232276 0.232273 0.229229 0.229226 0.233578 0.233576
chargesum: 0.00000
title: Mulliken charges with hydrogens summed into heavy atoms:
elementType: O O C C C C C C C C C C C C C C C C C C C C C C C C
charge: -0.203795 -0.203785 0.024372 0.024345 0.009475 0.009450 -0.117350 -0.117332 0.394737 0.394815 -0.085213 -0.085330 -0.146718 -0.146759 0.436768 0.436740 -0.152577 -0.152555 -0.109552 -0.109622 -0.015979 -0.015976 -0.034157 -0.034116 0.000058 0.000057
polarizability: 5.64291912e+02 2.48284173e-02 2.08963899e+02 -8.07017393e-01 9.57728820e-03 1.81257115e+02
1716.lowfreq: -11.8614 -3.1665 -1.5350 -0.0004 0.0004 0.0010 18.6674 20.2442 47.0778
frequency: 18.5350 18.9581 46.6388 57.3593 79.1941 85.7328 96.2789 102.3772 112.9349 132.9966 140.8934 175.1651 184.0095 197.9782 228.4984 234.3237 252.6622 260.1419 293.9144 322.0493 332.1021 338.1449 351.7543 364.5434 409.5171 409.7107 449.3237 460.7905 465.9269 494.9334 501.7423 542.5108 554.8567 582.2059 596.6916 614.6986 616.1445 676.0250 695.8198 696.5848 702.5759 721.4655 743.5913 747.5477 765.1394 773.4543 777.9654 792.0458 803.0767 828.5124 846.6006 846.7034 861.8430 908.7247 911.5103 918.4832 921.1698 937.8917 962.8057 966.4634 979.7977 981.4021 982.9977 987.7409 989.7323 999.7214 999.8399 1024.7811 1025.9968 1029.7923 1042.9968 1062.9659 1078.0991 1089.9165 1093.4658 1103.6165 1124.5804 1137.9944 1173.5996 1174.4327 1185.8434 1197.4400 1198.0927 1199.2518 1213.6099 1218.0189 1252.6300 1267.8781 1292.3318 1293.0519 1296.2757 1309.7223 1319.3605 1332.3430 1337.3500 1338.0674 1343.3432 1360.4321 1373.5789 1373.8440 1405.4597 1405.5884 1438.6476 1438.6824 1459.6895 1460.2634 1469.0608 1475.7968 1482.5003 1483.0386 1490.5692 1499.9890 1502.2065 1515.3764 1576.5449 1576.7554 1607.1987 1607.4367 1616.0746 1622.1506 2969.2028 2969.3961 2980.1647 2980.2337 3010.1721 3010.5072 3014.1087 3027.7368 3031.9904 3042.5151 3065.9615 3065.9909 3077.5233 3077.7139 3124.0097 3124.0190 3132.0108 3132.0234 3146.0591 3146.0639 3163.9335 3164.0242 3197.3967 3197.4415
redmass: 4.9332 6.4295 3.7054 4.0643 5.4789 4.9056 5.8860 3.2660 6.2211 5.3211 5.1744 2.6908 4.2077 5.1055 4.3637 3.7777 4.7169 3.1465 2.9186 3.8045 3.5124 2.7316 2.9938 2.5587 2.8614 2.8492 3.0257 4.9491 2.9096 3.4619 2.6986 6.2795 4.0768 3.4073 3.9445 6.2758 5.7298 5.5378 1.6551 1.6732 1.5372 3.5435 3.3553 3.6188 2.2026 2.0400 1.8456 2.4431 4.0525 2.6575 1.3151 1.2689 2.9193 2.6146 2.0855 1.3704 1.5827 2.1874 1.5161 1.5517 1.8458 1.4281 1.5907 5.5490 4.1136 1.3405 1.3401 2.5514 1.8220 2.1459 2.1290 3.2296 2.0171 1.6319 1.7293 2.5612 1.7159 1.3331 1.1012 1.0690 1.4040 1.1385 1.1289 1.2782 1.4382 2.3042 2.3239 1.2838 1.1411 1.4026 3.9710 1.3368 1.4085 1.4046 1.3419 1.2508 1.4096 1.4460 3.4313 3.4890 2.0196 2.0413 2.1605 2.1741 1.0957 1.0946 1.0738 1.1023 2.2161 2.1249 7.7308 1.2822 1.1263 4.7184 5.5505 5.5256 6.0952 6.0273 6.9289 7.2685 1.0591 1.0603 1.0625 1.0613 1.0645 1.0642 1.0974 1.0995 1.0997 1.1024 1.0973 1.0971 1.0868 1.0868 1.0864 1.0864 1.0882 1.0882 1.0940 1.0940 1.1000 1.1000 1.0927 1.0927
irintensity: 0.6170 1.7311 0.0116 0.1435 0.4792 0.5045 0.3788 0.2584 2.6830 0.9258 0.1580 0.0686 0.0605 6.0493 1.4744 7.4732 1.1758 13.6840 6.0785 0.0865 1.4217 1.8397 0.0968 0.8131 3.8237 0.0467 47.9064 0.2723 0.1599 23.7188 10.1324 60.2649 2.1321 49.4379 1.4272 0.5224 0.0087 35.6195 31.8613 65.9748 16.8399 5.0232 0.8826 40.7704 23.4934 39.5407 33.6879 0.2502 0.1456 17.3813 0.6260 0.1502 23.4701 192.3192 0.1597 0.0095 45.4639 0.2606 11.4001 36.2296 4.0254 2.2424 22.1666 0.0072 8.9014 0.4426 1.5865 0.0015 87.6155 69.9571 0.2283 1.3485 0.0696 4.7681 8.6678 0.5650 299.3980 0.5700 15.1938 0.1744 78.0758 2.1678 4.9165 2.3849 51.4745 0.0291 40.4172 6.4122 0.0915 0.3115 1.3238 0.0012 25.5872 0.0079 0.6204 3.5502 0.4770 0.0291 2.3994 1.5020 22.7788 1.9871 27.9233 16.3631 8.8977 11.2871 0.1809 2.9560 1.2753 40.7587 33.2923 293.4139 0.1833 569.9969 7.4820 0.7600 14.8700 0.4306 135.9388 0.1172 20.8242 34.9606 20.4703 28.2835 28.6425 0.0529 9.7871 0.9040 82.0457 99.8912 7.5408 52.2013 0.6871 1.3467 6.9048 1.5657 0.2060 0.2475 21.8291 28.3067 89.1429 3.2460 6.4606 8.6891
temp: 298.150 k
press: 1.00000 atm
elementType: 8 8 6 6 6 6 6 6 6 6 6 6 6 6 6 6 6 6 6 6 6 6 6 6 6 6 1 1 1 1 1 1 1 1 1 1 1 1 1 1 1 1 1 1 1 1 1 1 1 1
symmnumber: 1
zpe: 1080834.4 jmol-1
zpe.correction: 0.411668 hartree
zpe.thermalcorrener: 0.434605 hartree
zpe.thermalcorrenthalpy: 0.435550 hartree
zpe.thermalcorrgfe: 0.358304 hartree
zpe.sumelectzpe: -1077.507637 hartree
zpe.sumelectthermal: -1077.484699 hartree
zpe.sumelectthermalent: -1077.483755 hartree
zpe.sumelectthermalfe: -1077.561000 hartree
dipole: 0.0017 3.5299 -0.0028
dipole: 3.5299
quadrupole: -108.2858 -152.0943 -159.3560
quadrupole: 0.0044 1.6672 0.0033
quadrupole: 31.6262 -12.1823 -19.4439 0.0044 1.6672 0.0033
hfenergy: -1077.9193047 hartree
pointgroup: C01 [X(C24H24O2)]
dipole: 0.0004971 -1.3887483 0.0024637 debye
polarizability: 564.1760328|-0.0555551|208.9638986|6.7097675|-0.0184076|181.3729954 unknown
InChI: InChI=1S/C24H24O2/c25-23-21(17-19-11-5-3-6-12-19)15-9-1-2-10-16-22(24(23)26)18-20-13-7-4-8-14-20/h3-8,11-14,17-18H,1-2,9-10,15-16H2
charge 0 multiplicity 1
50 atoms
O  0.542332 1.455299 1.537993
O  -0.542654 1.450985 -1.544039
C  0.708882 -2.566022 0.318071
C  -0.708248 -2.56702 -0.313532
C  1.849875 -2.240382 -0.678779
C  -1.849337 -2.238898 0.682389
C  1.837106 -0.770541 -1.211083
C  -1.83689 -0.767727 1.210985
C  1.919265 0.268069 -0.104124
C  -1.919276 0.268177 0.101512
C  0.638852 0.827434 0.433511
C  -0.638977 0.826161 -0.437826
C  3.064297 0.74959 0.501267
C  -3.064469 0.748612 -0.504435
C  4.492136 0.490128 0.280902
C  -4.492281 0.490043 -0.282736
C  5.408164 1.353408 0.961505
C  -5.408395 1.353074 -0.963532
C  5.045571 -0.54059 -0.540531
C  -5.045605 -0.539618 0.540106
C  6.801584 1.212163 0.819279
C  -6.801775 1.212699 -0.820063
C  6.440445 -0.682172 -0.681418
C  -6.440446 -0.680373 0.682179
C  7.326764 0.191363 -0.007855
C  -7.326836 0.19298 0.008479
H  0.901836 -3.55747 0.773537
H  0.756362 -1.84182 1.15446
H  -0.901014 -3.559766 -0.766245
H  -0.75588 -1.845177 -1.151964
H  1.788587 -2.925358 -1.549084
H  2.818374 -2.441562 -0.180272
H  -1.788041 -2.921638 1.554456
H  -2.817756 -2.441527 0.184309
H  0.91795 -0.605114 -1.798781
H  2.66935 -0.633213 -1.925393
H  -0.917805 -0.600648 1.798334
H  -2.669208 -0.628794 1.924894
H  2.865887 1.500822 1.282529
H  -2.866275 1.498163 -1.287362
H  5.006153 2.147255 1.602823
H  -5.006467 2.146073 -1.605949
H  4.393517 -1.245728 -1.058175
H  -4.393527 -1.244683 1.057821
H  7.476784 1.891519 1.350743
H  -7.477041 1.891883 -1.351664
H  6.840582 -1.48171 -1.314874
H  -6.840506 -1.479133 1.316663
H  8.410121 0.07395 -0.120934
H  -8.410165 0.076229 0.122504
