program: Gaussian 09
title: 000264829
version: EM64L-G09RevD.01
frameworkgroup: C1[X(C13H9NO3)]
method: RPBEPBE
basis: SDD
operation: Freq
keyword: #p
keyword: freq=noraman
keyword: PBEPBE/SDD
title: #p freq=noraman PBEPBE/SDD
converged: YES YES NO NO
title: Mulliken charges:
elementType: O O O N C C C C C C C C C C C C C H H H H H H H H H
charge: -0.307574 -0.183249 -0.214198 0.040123 0.217135 0.149567 -0.335207 -0.314062 -0.213222 -0.214957 -0.256149 -0.227086 -0.216624 0.183152 -0.288073 -0.266759 0.149856 0.271544 0.253281 0.268044 0.262638 0.239487 0.235951 0.238043 0.266311 0.262030
chargesum: 0.00000
title: Mulliken charges with hydrogens summed into heavy atoms:
elementType: O O O N C C C C C C C C C C C C C
charge: -0.307574 -0.183249 -0.214198 0.040123 0.217135 0.149567 -0.063663 -0.060781 0.026264 0.020994 0.011895 0.035552 0.021418 0.183152 -0.021762 -0.004730 0.149856
polarizability: 3.29086555e+02 -1.88526695e+01 1.64102063e+02 2.60882939e-01 -2.49504955e-02 5.89799729e+01
1716.lowfreq: -11.2687 -5.0355 -0.0005 0.0005 0.0007 3.2376 6.7788 34.8430 52.4520
frequency: -7.6418 34.7973 52.4497 60.0647 111.8352 162.8415 164.9123 217.2538 230.4561 293.1140 307.3863 397.9981 400.5654 413.5977 436.1671 438.0756 475.8668 505.0058 548.2081 599.6104 612.9411 653.2931 670.7346 696.4797 742.4968 766.1490 767.7877 784.4337 793.7695 859.0967 860.7531 875.2675 894.7067 931.5831 941.4557 952.4667 990.5432 991.6858 993.9823 997.5888 1010.7461 1027.4828 1086.4130 1090.9944 1159.8474 1176.6900 1184.3884 1220.7369 1253.1607 1316.4598 1320.5091 1351.2515 1390.8975 1402.5930 1438.6080 1473.9439 1479.1735 1549.5902 1578.3224 1586.5174 1610.4235 1632.1030 1683.0593 3135.2094 3146.7483 3151.3515 3151.8061 3158.6862 3170.2146 3175.7679 3181.9175 3182.2770
redmass: 4.1221 4.8117 6.6096 8.4549 8.9808 5.4998 5.7921 8.7948 6.7922 7.5738 5.1466 9.4659 2.7964 3.7054 5.7985 3.8241 9.8573 2.2849 7.9945 7.3055 6.4580 7.5487 5.0752 1.6374 6.5171 3.9434 6.2457 1.3578 2.0804 8.0925 1.2619 1.8899 11.1598 5.3797 4.0226 1.4219 6.1817 1.2982 1.3769 1.3019 1.3381 2.1040 1.5247 1.4812 1.1176 1.0554 1.1620 3.3625 1.7217 1.3759 2.2351 1.7419 9.7790 3.5615 2.2494 4.5983 2.9498 7.2818 7.9825 6.2365 6.0427 6.5734 12.7409 1.0858 1.0892 1.0881 1.0875 1.0939 1.0981 1.0994 1.0979 1.0983
irintensity: 0.1733 0.0036 0.9840 4.8291 3.1173 3.7926 7.5116 0.0543 0.7699 6.3306 0.1109 7.1715 0.0068 0.4997 4.4728 1.0597 7.7695 14.7707 2.5859 0.8031 5.0578 3.8138 19.8281 79.1989 216.9983 2.1667 66.2271 0.3209 28.3263 2.5803 1.4769 83.3334 578.6470 418.0230 212.9379 4.1711 0.3006 0.0012 0.1721 0.0663 0.2241 6.3704 1.2313 31.2762 58.2058 0.0826 80.9645 326.1161 7.1446 2.1379 7.2405 8.0158 2.0839 2.6913 19.7688 39.5886 8.3520 143.8652 10.4088 6.6488 31.5020 49.6075 239.2625 0.1096 6.8108 0.8463 0.2147 12.1867 27.3166 8.6485 9.0349 2.8959
temp: 298.150 k
press: 1.00000 atm
elementType: 8 8 8 7 6 6 6 6 6 6 6 6 6 6 6 6 6 1 1 1 1 1 1 1 1 1
symmnumber: 1
zpe: 491098.8 jmol-1
zpe.correction: 0.187050 hartree
zpe.thermalcorrener: 0.200291 hartree
zpe.thermalcorrenthalpy: 0.201235 hartree
zpe.thermalcorrgfe: 0.145779 hartree
zpe.sumelectzpe: -779.963214 hartree
zpe.sumelectthermal: -779.949973 hartree
zpe.sumelectthermalent: -779.949029 hartree
zpe.sumelectthermalfe: -780.004485 hartree
dipole: -4.6633 -2.1693 0.0237
dipole: 5.1432
quadrupole: -101.1969 -95.9325 -100.6796
quadrupole: 16.7786 0.1717 0.0528
quadrupole: -1.9273 3.3372 -1.4099 16.7786 0.1717 0.0528
hfenergy: -780.150264 hartree
pointgroup: C01 [X(C13H9N1O3)]
dipole: 1.8427706 0.8353751 -0.0304277 debye
dipolederiv: -3.1044081 0.3670778 -0.0999138 -0.3497915 -0.3489071 0.0136516 -0.0163081 0.0282225 -0.1239229 -0.8270045 -0.0454028 -0.0091168 0.3853879 -1.0451122 0.0754529 -0.0497314 0.0652695 -0.2889038 -1.1176444 0.2429086 -0.0422377 0.3492939 -0.5552974 0.0315399 -0.0538364 0.0291154 -0.3483156 1.4012428 -0.1751115 0.0512876 0.9585519 -0.1620545 0.0234563 -0.0768898 0.0023459 -0.1223581 -0.7213447 -0.2399604 0.0051626 -0.3361417 -0.2365452 0.0122036 0.0163915 0.0147358 -0.0143427 -0.3382022 0.1103028 -0.021913 0.1349875 0.16069 -0.004767 -0.0211221 -0.0058824 0.1017585 0.1615336 0.1622066 -0.0078711 -0.1723342 0.0661919 -0.0171175 0.0186549 -0.0110755 -0.1041451 0.0713947 -0.0351852 0.0045653 0.2551628 0.0274461 -0.0059415 -0.0195125 -0.0121955 -0.1120035 0.072621 -0.1471151 0.0149713 -0.2386963 -0.1738603 -0.0026526 0.0227671 -0.0004422 -0.1489033 -0.3169956 -0.0431107 0.00044 0.0124867 0.1548233 -0.023758 -0.0030848 -0.0252978 -0.1482496 0.3371576 -0.1384654 0.0246713 0.0861442 0.110078 -0.0247086 -0.0036382 -0.0288607 -0.114772 0.1402607 0.0334692 -0.001444 -0.2083863 -0.070095 -0.0049775 0.0274471 -0.0001464 -0.0715364 0.0860471 0.0668104 -0.002354 0.0718439 0.0796073 -0.015349 -0.0022199 -0.0153676 -0.124792 3.3685253 -0.0006329 0.0719075 -0.8401969 1.4462262 -0.1233456 0.1513799 -0.1059499 0.2649019 -0.0923443 0.1409111 -0.0166504 0.4542414 -0.3647134 0.0347355 -0.0527802 0.0284879 -0.1474207 -0.5060462 -0.0516901 -0.0007941 -0.2512607 0.1217349 -0.031993 0.024421 -0.028627 -0.107086 1.136962 -0.1747884 0.0361715 -0.2893431 0.7395014 -0.0687327 0.0494491 -0.0661755 0.2177198 0.1499772 -0.0148642 0.0014336 0.0368529 -0.0111325 0.0140071 -0.0035625 0.0133644 0.1568988 0.0018977 0.0711416 -0.00765 0.1307621 0.0720696 0.0088671 -0.0124778 0.0084546 0.1501488 0.1047424 0.0385479 -0.0051257 -0.0315712 -0.0215573 0.0205293 0.002935 0.021481 0.153348 0.0325705 -0.0929837 0.0096137 -0.0587898 0.0390324 0.0123145 0.0057438 0.0112445 0.1491346 -0.1031605 0.0631272 -0.0094316 0.0696754 0.0580272 0.0093123 -0.0097446 0.0092046 0.1601422 0.0750496 0.0246185 -0.0033763 -0.0201734 -0.1015413 0.0201965 0.0004874 0.0213053 0.1576261 -0.0567188 -0.094618 0.0040771 -0.1048114 0.0290205 0.0085531 0.0046342 0.0088787 0.1568877 -0.01774 -0.0766366 0.0062615 -0.033659 0.0342611 0.0151248 0.0010528 0.0143045 0.1630725 0.061627 0.0094433 -0.0026846 -0.0102349 -0.0478937 0.0233987 -0.0004555 0.023606 0.1451128 unknown
polarizability: 328.5575576|-19.9053677|163.4495889|7.6717608|-10.527903|60.1614445 unknown
InChI: InChI=1S/C13H9NO3/c15-12-8-6-11(7-9-12)14-17-13(16)10-4-2-1-3-5-10/h1-9H
charge 0 multiplicity 1
26 atoms
O  0.262697 -0.415731 0.066813
O  1.531944 -2.411756 0.269378
O  -5.747557 1.332033 -0.244601
N  -0.912109 -1.265581 0.140445
C  2.662131 -0.252834 0.105153
C  -2.026881 -0.527984 0.033966
C  3.957006 -0.834808 0.172119
C  2.525355 1.156516 -0.009827
C  5.101845 -0.015438 0.124474
C  3.675484 1.971217 -0.057038
C  -3.262404 -1.318017 0.108809
C  -2.117832 0.925573 -0.140524
C  4.963613 1.38886 0.009617
C  1.499338 -1.178208 0.161631
C  -4.48899 -0.711991 0.018261
C  -3.345298 1.529488 -0.231449
C  -4.61209 0.753521 -0.157969
H  4.041164 -1.922961 0.26053
H  1.528875 1.602651 -0.060024
H  -3.151763 -2.399613 0.23859
H  -1.189916 1.500959 -0.195889
H  6.09818 -0.466625 0.176404
H  3.570031 3.057679 -0.145193
H  5.854463 2.025516 -0.027313
H  -5.42183 -1.282656 0.071728
H  -3.448857 2.61249 -0.36269
