program: Gaussian 09
title: 000264854
version: EM64L-G09RevD.01
frameworkgroup: C1[X(C17H22O3)]
method: RPBEPBE
basis: SDD
operation: Freq
keyword: #pfreq=noraman
keyword: PBEPBE/SDD
title: #p freq=noraman PBEPBE/SDD
converged: YES YES NO NO
title: Mulliken charges:
elementType: O O O C C C C C C C C C C C C C C C C C H H H H H H H H H H H H H H H H H H H H H H
charge: -0.287625 -0.171200 -0.228577 0.143543 -0.447646 -0.401161 -0.616986 -0.400024 0.140046 -0.399072 -0.501591 0.210223 0.499285 -0.395369 -0.380610 -0.257164 -0.235859 -0.236596 -0.240672 -0.668889 0.200085 0.226954 0.190495 0.249644 0.237241 0.205865 0.189355 0.209029 0.200907 0.235446 0.210786 0.234170 0.245206 0.219486 0.244224 0.217058 0.220314 0.222223 0.225949 0.220287 0.222102 0.249114
chargesum: 0.00000
title: Mulliken charges with hydrogens summed into heavy atoms:
elementType: O O O C C C C C C C C C C C C C C C C C
charge: -0.287625 -0.171200 -0.228577 0.143543 -0.020607 0.038978 -0.173880 -0.001640 0.140046 0.045884 -0.065238 0.210223 0.499285 -0.150163 -0.161124 0.204118 -0.015545 -0.014372 -0.014723 0.022614
polarizability: 2.16931109e+02 6.86548788e+00 1.97137302e+02 1.59761657e+01 -6.14476258e+00 1.35214954e+02
1716.lowfreq: -9.3431 -8.1087 0.0002 0.0005 0.0006 5.4795 14.5866 23.5657 50.6318
frequency: 14.2468 23.4466 50.6228 54.1747 56.9955 77.6913 105.7916 131.2879 147.8592 164.1406 193.7742 200.4041 223.4561 230.8079 253.7033 266.6557 315.0240 329.6513 339.8777 365.6218 373.7771 404.3185 425.7075 443.5517 470.4237 498.7053 539.4527 569.4242 588.5488 618.6832 680.0223 701.1882 702.8583 715.5293 746.9674 772.5363 795.1386 815.4923 816.2156 841.4387 843.2280 850.2005 875.6346 890.0376 917.8478 922.2212 939.8269 972.8618 982.2824 990.6028 993.0683 1011.4091 1016.2097 1028.1847 1032.4216 1055.3394 1073.4478 1083.0915 1094.9079 1109.7931 1128.4397 1142.8537 1156.0251 1167.0182 1171.6692 1189.2111 1194.8706 1213.0575 1218.2854 1248.9677 1271.2488 1277.8970 1293.0780 1303.1124 1315.0688 1333.2644 1344.3139 1346.1991 1354.3817 1356.1195 1359.8278 1385.5371 1389.8021 1441.5882 1452.8215 1456.8197 1460.7699 1463.7747 1464.3762 1465.7442 1473.5036 1480.9596 1484.4290 1485.0556 1593.3576 1602.1581 1615.6629 1639.0636 2958.7753 2970.2153 2982.9212 2985.1151 2985.5604 2987.9571 2991.9484 3021.0356 3028.8361 3031.5833 3039.7735 3048.1081 3056.1988 3067.1899 3086.1377 3092.1973 3111.0818 3117.6315 3122.9607 3137.3910 3152.4354 3164.3489
redmass: 4.1231 4.4100 3.4408 3.4223 3.9029 4.2094 4.8566 3.6052 3.9541 4.2699 3.3153 2.0271 2.6834 2.7514 2.5689 2.9938 2.9018 2.2282 3.9662 2.3016 2.5234 2.8183 3.7616 3.7571 1.8796 3.1214 2.9468 3.9433 4.4553 6.2552 4.2301 2.2782 3.0892 2.1674 2.3949 2.0252 3.3425 2.4621 1.8355 1.7710 2.0799 1.2680 2.0326 2.1373 2.1785 1.5368 2.2478 1.4151 2.2322 2.2008 2.1631 3.0423 2.7154 2.2746 2.5793 1.8716 2.6467 1.6735 2.1809 2.5237 2.3428 1.9227 1.6680 1.6747 1.0829 1.1199 1.1702 1.6223 2.0682 1.3273 1.2193 1.1168 1.3954 1.3276 1.4704 1.2819 1.4718 1.3508 1.3361 1.4160 1.4021 6.5473 1.2346 2.1644 1.1060 1.0951 1.0959 1.0540 1.0818 1.0889 1.0841 1.1346 1.8842 1.1068 6.0535 10.2050 6.1520 10.2278 1.0631 1.0605 1.0644 1.0604 1.0634 1.0624 1.0360 1.0974 1.0975 1.0591 1.1020 1.1018 1.0983 1.1003 1.0983 1.1026 1.0873 1.1065 1.0861 1.0923 1.0953 1.1004
irintensity: 0.1340 1.6942 0.5662 1.3305 0.3471 1.6244 0.0397 2.0545 0.3697 0.8876 1.2145 3.2323 0.6881 0.6181 0.6209 0.5876 6.3261 1.7287 5.9868 0.7745 0.9845 0.0569 4.0233 2.4443 1.9270 6.1181 10.2017 15.9719 11.0254 0.2389 2.3751 29.3162 16.8569 31.0103 1.3882 31.0407 2.5592 5.3999 0.8394 8.4152 7.6536 0.7241 2.1726 5.1078 20.4664 1.3781 35.7551 2.8390 17.4061 0.4039 0.2795 11.9653 129.0479 3.7871 2.3285 7.0381 5.7320 63.0026 28.9626 71.1243 44.9303 75.2944 14.0587 6.2587 1.4670 1.1905 2.2472 0.6814 1.4390 16.1894 1.6471 3.6742 3.7454 11.2686 41.5615 6.6094 6.5164 1.3921 0.1714 0.6964 1.7424 1.3903 26.2587 5.2991 12.8638 11.0963 6.0103 13.4887 3.0758 7.8049 10.1412 41.7946 19.4318 5.4271 2.2065 75.6600 4.7870 143.3686 36.8653 14.3109 22.6139 25.1850 15.6397 43.8384 20.4392 56.8665 42.6158 26.0711 14.8360 51.5620 13.5757 19.1239 30.3775 5.6800 15.7193 28.7378 0.5028 29.6569 37.0207 16.3820
temp: 298.150 k
press: 1.00000 atm
elementType: 8 8 8 6 6 6 6 6 6 6 6 6 6 6 6 6 6 6 6 6 1 1 1 1 1 1 1 1 1 1 1 1 1 1 1 1 1 1 1 1 1 1
symmnumber: 1
zpe: 924878.2 jmol-1
zpe.correction: 0.352268 hartree
zpe.thermalcorrener: 0.371935 hartree
zpe.thermalcorrenthalpy: 0.372879 hartree
zpe.thermalcorrgfe: 0.302293 hartree
zpe.sumelectzpe: -885.166913 hartree
zpe.sumelectthermal: -885.147246 hartree
zpe.sumelectthermalent: -885.146302 hartree
zpe.sumelectthermalfe: -885.216888 hartree
dipole: -1.3710 0.8874 -3.6066
dipole: 3.9591
quadrupole: -111.9735 -101.3811 -128.7803
quadrupole: 5.0830 5.9404 1.5089
quadrupole: 2.0715 12.6639 -14.7353 5.0830 5.9404 1.5089
hfenergy: -885.5191809 hartree
pointgroup: C01 [X(C17H22O3)]
dipole: -0.4593675 0.4825253 -1.4079708 debye
polarizability: 218.7344072|2.2611789|195.7028362|14.7200653|-7.5552455|134.846121 unknown
InChI: InChI=1S/C17H22O3/c1-2-20-16(19)17(12-8-4-7-11-15(17)18)13-14-9-5-3-6-10-14/h3,5-6,9-10H,2,4,7-8,11-13H2,1H3
charge 0 multiplicity 1
42 atoms
O  0.465365 2.225573 -0.146892
O  -0.418484 -1.188525 1.639897
O  -1.076127 1.696566 1.511194
C  -0.766601 0.134826 -0.386454
C  -2.005518 0.519281 -1.277341
C  -3.366709 0.662174 -0.547591
C  0.407342 -0.271951 -1.366934
C  -4.149683 -0.666497 -0.407503
C  -1.038509 -1.067835 0.553576
C  -3.500273 -1.718723 0.518986
C  -2.048032 -2.126221 0.115189
C  -0.472172 1.385197 0.461141
C  1.721097 -0.744686 -0.757331
C  2.799983 0.1533 -0.551175
C  1.91537 -2.113521 -0.437181
C  0.729327 3.527747 0.544031
C  4.030857 -0.300687 -0.027474
C  3.142579 -2.572431 0.088354
C  4.20677 -1.665606 0.296954
C  -0.269439 4.594444 0.087957
H  -2.102496 -0.23588 -2.083927
H  -1.748899 1.470754 -1.783588
H  -3.994829 1.368421 -1.125079
H  -3.215488 1.119922 0.449156
H  0.586317 0.605203 -2.014593
H  0.000415 -1.074152 -2.01446
H  -4.285648 -1.108476 -1.417177
H  -5.165522 -0.444508 -0.024611
H  -2.008545 -2.301646 -0.977899
H  -1.776476 -3.063169 0.633038
H  -4.124258 -2.63323 0.512939
H  -3.486537 -1.350974 1.56327
H  2.664124 1.21024 -0.802323
H  1.098859 -2.828635 -0.601581
H  0.672052 3.359595 1.633219
H  1.762872 3.772714 0.249972
H  4.853324 0.40805 0.123723
H  3.268819 -3.633033 0.333374
H  5.161218 -2.018701 0.703645
H  -0.008421 5.567956 0.543066
H  -0.250269 4.711703 -1.009623
H  -1.292757 4.332017 0.404754
