program: Gaussian 09
title: 000024652
version: EM64L-G09RevD.01
frameworkgroup: C1[X(C22H31NS2)]
method: RPBEPBE
basis: SDD
operation: Freq
keyword: #p
keyword: freq=noraman
keyword: PBEPBE/SDD
title: #p freq=noraman PBEPBE/SDD
converged: YES YES NO NO
title: Mulliken charges:
elementType: S S N C C C C C C C C C C C C C C C C C C C C C C H H H H H H H H H H H H H H H H H H H H H H H H H H H H H H H
charge: 0.158404 0.170871 -0.085543 -0.813524 0.510759 0.530556 -0.671061 -0.286294 -0.358332 -0.389336 -0.359356 -0.429851 -0.188879 -0.267919 -0.220533 0.429309 -0.308569 -0.398888 -0.387443 -0.690863 -0.318970 -0.616137 -0.613778 -0.806637 -0.687960 0.273967 0.268144 0.263646 0.185400 0.225850 0.257098 0.241236 0.271169 0.231544 0.251581 0.243923 0.222825 0.198475 0.231490 0.229538 0.245613 0.260989 0.187345 0.213472 0.186734 0.222637 0.228981 0.223170 0.184803 0.230155 0.236839 0.226206 0.224410 0.211381 0.216418 0.204940
chargesum: 0.00000
title: Mulliken charges with hydrogens summed into heavy atoms:
elementType: S S N C C C C C C C C C C C C C C C C C C C C C C
charge: 0.158404 0.170871 -0.085543 -0.539558 0.510759 0.530556 -0.139271 0.124956 -0.101234 -0.148100 -0.088187 -0.198307 -0.188879 -0.016338 0.023389 0.429309 0.112732 -0.167399 -0.157905 -0.184262 0.081847 0.022214 0.024350 -0.119181 -0.055222
polarizability: 3.59225320e+02 -1.65633896e+01 2.91964296e+02 -1.12227484e-01 -4.78029677e+00 2.24112767e+02
1716.lowfreq: -11.5243 -9.6946 0.0014 0.0024 0.0026 2.1757 3.4795 11.3140 13.4529
frequency: -9.2761 10.8681 13.4030 15.6751 19.2942 25.5626 27.7331 31.5178 48.5236 54.4754 78.0736 85.1402 95.7177 112.9226 126.3198 146.1381 156.2723 178.8158 189.6036 212.4500 218.5487 227.4037 238.0567 257.2436 275.5568 283.7014 297.5743 314.1924 322.0133 338.4480 357.3608 366.0960 402.5668 404.8462 408.2640 418.5055 444.3958 463.8775 507.7881 512.2886 549.0348 589.3543 625.8871 630.3536 655.0529 690.2046 694.6893 725.0016 738.3588 744.8384 756.1446 762.5269 795.2688 799.8723 813.7131 834.4351 844.8429 848.4915 857.3024 864.1139 866.3619 919.0346 956.0893 957.1072 976.8422 985.0466 987.2257 1002.0664 1003.9846 1011.7878 1012.5635 1015.6742 1033.9626 1047.2283 1061.1797 1067.9945 1074.4697 1076.2954 1088.3769 1105.2186 1109.6141 1119.4227 1123.9457 1149.6256 1161.9292 1174.8522 1187.8056 1191.7400 1198.5556 1212.0964 1220.2587 1221.7959 1222.8171 1258.0213 1263.9540 1267.5105 1272.7624 1289.0581 1297.0978 1302.6861 1303.2447 1316.5227 1358.5577 1360.3418 1363.6985 1381.9198 1388.4550 1396.4790 1397.4241 1405.4947 1418.7170 1436.2705 1438.4543 1441.4108 1457.5557 1461.0807 1464.6782 1471.7034 1472.7910 1473.3262 1475.3573 1475.8592 1476.9490 1477.2373 1484.7255 1486.7927 1503.4882 1571.7407 1579.9164 1598.7538 1621.6429 2832.1503 2844.9015 2861.5422 2955.8487 2971.2151 2972.4323 2974.9977 3008.1044 3014.8642 3019.0548 3019.2610 3026.8668 3031.3880 3035.6548 3039.7091 3056.2924 3068.7529 3072.2876 3078.3281 3084.9359 3086.8388 3088.6568 3105.4550 3110.6610 3116.2165 3122.5296 3134.1515 3140.8788 3142.3238 3147.5165 3163.0042
redmass: 4.1139 3.6096 3.4789 3.7444 3.1525 1.8531 1.5053 4.2755 4.0070 3.9548 1.9508 3.7837 2.0828 3.5130 3.4261 3.9006 4.3338 3.9347 3.0019 5.4096 1.1149 1.1613 1.1891 2.2593 3.4941 4.7651 4.4542 3.8196 4.4991 2.5944 3.6117 3.7597 2.9462 2.7317 2.7876 4.4977 2.5964 3.0820 3.4290 3.1422 4.1973 4.5126 6.6134 6.7471 5.4171 4.4157 5.7391 3.6673 2.6733 1.1885 1.8150 1.9583 2.0515 2.3527 4.3901 1.7067 1.7665 1.7515 1.4265 1.8894 1.4040 1.4147 1.3435 1.3625 1.3744 1.3570 1.3967 1.7166 3.0879 2.5980 2.8946 2.5376 1.5720 1.5607 1.9452 2.8379 1.4827 2.6231 1.3092 2.0304 1.4139 1.3229 1.3074 1.5867 1.1886 2.6214 1.1158 1.1988 1.3925 1.7887 1.4119 1.3579 2.8553 1.6644 2.1296 1.9564 1.2201 1.1307 1.3084 1.2314 1.2705 1.3901 1.5920 1.3911 4.6030 4.1384 1.2146 3.0076 1.2303 2.7180 1.1392 1.0943 1.0877 1.1538 1.0783 1.0499 1.0737 1.0941 1.0636 1.0548 1.3741 1.5180 1.0739 1.0448 1.0533 1.0810 2.6920 7.0714 5.9181 6.1654 6.3935 1.0697 1.0573 1.0582 1.0622 1.0424 1.0562 1.0386 1.0825 1.0848 1.0707 1.0722 1.0681 1.0642 1.0995 1.0856 1.0950 1.1007 1.0993 1.1010 1.0998 1.1005 1.1062 1.1057 1.0870 1.0875 1.0878 1.0960 1.0945 1.0900 1.0963 1.0965
irintensity: 0.1641 0.3082 0.4770 0.0259 0.4175 0.4873 0.1505 0.0274 0.3662 0.4172 0.1553 0.8207 1.9442 0.1647 0.6106 3.2099 0.2596 1.5302 0.8797 0.1894 1.8463 0.0572 1.4835 0.5567 0.9090 1.4891 0.3098 1.4199 0.2882 9.4953 0.0969 3.6648 0.1789 1.2172 0.4711 0.8553 1.4151 1.0413 15.5730 14.1741 15.0480 3.1008 1.4309 2.5613 8.4843 9.8999 24.9855 0.2039 7.8743 23.5448 16.0674 10.6569 24.4123 11.7250 13.4649 19.8478 7.9590 6.7059 6.3830 15.2036 6.0529 18.3516 0.3963 0.9475 0.2956 1.2168 0.3684 11.2296 19.9024 4.0676 5.1254 32.8142 21.4116 16.8977 4.2435 32.1119 4.9317 3.1463 5.7730 2.8306 5.6209 13.5471 18.0857 7.2066 4.8509 1.9215 6.0025 0.5438 5.5231 1.1912 5.6723 1.6813 0.8346 10.8607 4.3369 6.8459 10.5546 11.9142 1.4392 4.8900 3.4883 1.3516 1.4396 2.1825 2.3849 0.9678 11.1227 9.7749 9.6960 2.7340 2.1061 13.6793 0.6120 2.3390 4.5341 13.5392 3.3609 15.6405 14.0695 14.0225 24.1045 45.8879 24.8849 9.7158 12.5139 13.7241 31.9595 3.7318 1.3514 2.2726 2.8640 86.1485 67.9238 192.8589 21.5329 51.1921 21.6365 39.0694 4.5426 9.5406 26.4713 50.4918 10.4977 49.5831 27.4224 14.8715 22.9062 76.0259 55.4610 26.6324 17.2780 49.8382 22.5607 12.8071 11.3602 15.8406 10.5328 28.2119 2.4797 3.7705 14.0680 4.1130
temp: 298.150 k
press: 1.00000 atm
elementType: 16 16 7 6 6 6 6 6 6 6 6 6 6 6 6 6 6 6 6 6 6 6 6 6 6 1 1 1 1 1 1 1 1 1 1 1 1 1 1 1 1 1 1 1 1 1 1 1 1 1 1 1 1 1 1 1
symmnumber: 1
zpe: 1239858.7 jmol-1
zpe.correction: 0.472237 hartree
zpe.thermalcorrener: 0.500361 hartree
zpe.thermalcorrenthalpy: 0.501305 hartree
zpe.thermalcorrgfe: 0.406550 hartree
zpe.sumelectzpe: -1705.898720 hartree
zpe.sumelectthermal: -1705.870596 hartree
zpe.sumelectthermalent: -1705.869652 hartree
zpe.sumelectthermalfe: -1705.964407 hartree
dipole: -1.4222 1.9789 3.6914
dipole: 4.4233
quadrupole: -163.1758 -157.3421 -165.5269
quadrupole: -1.3685 2.1895 -10.2040
quadrupole: -1.1609 4.6728 -3.5119 -1.3685 2.1895 -10.2040
hfenergy: -1706.3709569 hartree
pointgroup: C01 [X(C22H31N1S2)]
dipole: -0.5095817 -0.7100828 -1.5048505 debye
polarizability: 358.3890259|17.9234015|292.9950652|4.2088018|-0.6340915|223.9182919 unknown
InChI: InChI=1S/C22H31NS2/c1-5-6-16-24-21-13-11-20(12-14-21)22(25-17-15-23(3)4)19-9-7-18(2)8-10-19/h7-14,22H,5-6,15-17H2,1-4H3
charge 0 multiplicity 1
56 atoms
S  -1.966591 1.526889 1.557956
S  5.000305 1.805509 1.258344
N  -5.513505 1.917644 -0.670018
C  -0.997781 0.532885 0.207889
C  0.482252 0.80845 0.462904
C  -1.394134 -0.936437 0.155761
C  -3.744555 1.248359 0.968367
C  -4.115452 2.140989 -0.229895
C  1.320966 -0.104651 1.147497
C  1.041123 2.034629 0.012202
C  -1.671369 -1.700376 1.317588
C  -1.464645 -1.585554 -1.103239
C  3.230893 1.414208 0.910225
C  2.686388 0.191056 1.363594
C  2.397779 2.341924 0.238501
C  -2.052555 -3.727492 -0.0363
C  5.769181 0.500642 -1.207094
C  -1.995046 -3.070605 1.220561
C  -1.787133 -2.957355 -1.197408
C  5.680342 1.876156 -0.525947
C  6.802302 -0.454567 -0.569833
C  -6.070195 3.073686 -1.402189
C  -5.693312 0.656348 -1.418194
C  -2.372441 -5.209274 -0.132689
C  6.838715 -1.833366 -1.263175
H  -1.277081 1.014112 -0.746875
H  -3.852223 0.173213 0.748377
H  -4.381995 1.490533 1.834927
H  -3.386683 1.978039 -1.067001
H  -4.013177 3.197131 0.079247
H  0.916435 -1.061375 1.491791
H  0.398105 2.761977 -0.497914
H  -1.661081 -1.200833 2.293523
H  -1.260793 -1.013275 -2.017131
H  3.33191 -0.527663 1.8788
H  2.806244 3.304722 -0.087951
H  4.767623 0.025788 -1.20156
H  6.032711 0.663785 -2.274487
H  -2.21258 -3.638851 2.133557
H  -1.838934 -3.434677 -2.183841
H  6.675825 2.342082 -0.410319
H  5.030723 2.569104 -1.087335
H  7.80749 0.013009 -0.615216
H  6.560431 -0.577674 0.503741
H  -5.549667 3.282033 -2.372097
H  -7.137314 2.89152 -1.624158
H  -6.003021 3.980676 -0.775704
H  -6.765414 0.506837 -1.638431
H  -5.133726 0.642205 -2.389213
H  -5.351465 -0.203089 -0.817135
H  -1.450253 -5.819016 -0.065666
H  -3.039153 -5.534111 0.685518
H  -2.860634 -5.458234 -1.091386
H  5.853886 -2.333564 -1.198786
H  7.586955 -2.499673 -0.796048
H  7.095426 -1.73593 -2.335337
