program: Gaussian 09
title: 000264825
version: EM64L-G09RevD.01
frameworkgroup: C1[X(C12H18O2)]
method: RPBEPBE
basis: SDD
operation: Freq
keyword: #pfreq=noraman
keyword: PBEPBE/SDD
title: #p freq=noraman PBEPBE/SDD
converged: YES YES NO NO
title: Mulliken charges:
elementType: O O C C C C C C C C C C C C H H H H H H H H H H H H H H H H H H
charge: -0.201084 -0.201084 -0.015039 -0.015039 -0.462431 -0.462214 -0.462432 -0.462215 -0.525288 -0.525512 -0.525289 -0.525512 0.201597 0.201600 0.197585 0.197585 0.212129 0.222443 0.222546 0.212148 0.212130 0.222442 0.222546 0.212148 0.243863 0.217721 0.217697 0.243838 0.243863 0.217723 0.217698 0.243838
chargesum: 0.00000
title: Mulliken charges with hydrogens summed into heavy atoms:
elementType: O O C C C C C C C C C C C C
charge: -0.201084 -0.201084 0.182546 0.182546 -0.027858 -0.027520 -0.027860 -0.027521 -0.063704 -0.063977 -0.063704 -0.063977 0.201597 0.201600
polarizability: 1.64851224e+02 6.14554532e-06 1.17854354e+02 6.28121384e+00 2.00226424e-06 9.82845897e+01
1716.lowfreq: -17.8447 -5.6420 -0.0003 0.0005 0.0007 10.9825 22.5061 36.8758 62.6392
frequency: 22.4940 36.8757 62.6387 120.5844 125.8716 155.1162 160.7508 184.3090 245.6246 338.4414 365.9338 392.0336 400.9281 413.8523 416.8766 467.9166 483.7220 487.1216 532.4384 658.4055 685.0628 748.9128 750.7685 754.5903 761.9397 833.1755 846.1206 894.5029 896.6373 931.9882 934.3930 954.2731 958.3554 1025.1485 1028.3100 1061.1544 1062.8433 1076.2905 1089.2039 1102.4199 1109.5952 1114.1820 1160.5144 1167.4247 1183.6663 1216.1968 1238.6205 1248.2350 1257.4335 1258.2434 1260.2312 1271.7292 1282.8316 1306.2596 1312.7804 1312.7837 1317.5524 1322.5753 1333.4870 1350.1376 1355.4529 1370.5974 1437.2628 1437.2696 1446.6930 1447.0655 1461.1058 1468.9138 1472.1622 1480.3682 1637.5510 1638.9581 2923.4399 2938.2743 2964.1024 2964.1475 2970.7008 2970.9113 2972.6863 2973.1570 2978.0903 2980.1740 3043.3110 3049.6453 3053.2820 3057.3948 3069.4862 3069.5680 3072.1714 3072.2611
redmass: 2.9365 7.4795 6.2073 4.0561 3.3401 2.0496 2.0228 2.7660 4.5414 3.5460 1.8876 2.5069 3.6075 3.7377 1.7585 2.2425 3.2738 3.3715 2.7901 3.6860 2.9747 2.8222 3.5013 1.5376 1.5974 2.7114 2.0069 1.3749 1.4671 2.4414 2.2405 2.0584 2.0928 2.2005 3.3477 1.1802 1.9300 1.1493 2.4721 2.9861 2.1867 2.1820 1.2753 1.8457 2.1924 1.3755 1.3371 1.2426 1.5206 1.3466 1.5739 1.3581 1.3682 1.3438 1.3279 1.3220 1.5468 1.2886 1.6145 1.4761 1.5713 1.4535 1.0928 1.0926 1.0867 1.0869 1.0887 1.0836 1.0863 1.0848 9.2145 9.2425 1.0795 1.0833 1.0660 1.0659 1.0672 1.0665 1.0620 1.0629 1.0630 1.0624 1.0989 1.0993 1.0951 1.0962 1.0958 1.0959 1.0968 1.0967
irintensity: 1.8535 8.6901 0.0003 3.5348 2.2018 0.0000 1.3607 0.0001 0.0000 0.0000 1.8225 3.2164 0.0000 6.6188 0.0000 0.0002 11.1790 0.0000 0.3004 0.0000 4.8133 10.3968 0.0032 0.0010 5.2588 2.0102 0.0003 0.0000 2.1283 31.9233 0.0006 16.1262 0.0018 5.9235 0.0000 0.0081 7.9898 1.1993 0.0028 1.3414 0.0000 0.0013 11.5636 104.5828 0.0001 0.0013 7.2653 0.0064 13.6431 3.7375 0.0000 17.6038 0.0001 0.0002 0.0818 16.4163 0.0059 2.5558 0.0001 0.5233 9.3183 0.0097 30.4749 0.0506 37.8544 0.0004 14.6923 0.0006 0.0005 12.6515 388.8333 0.0010 0.0001 22.4919 13.0433 0.0046 0.0004 22.9404 0.0213 25.0154 0.0004 143.4869 0.0082 77.1972 81.1223 0.0000 0.0120 44.3846 44.3285 0.0093
temp: 298.150 k
press: 1.00000 atm
elementType: 8 8 6 6 6 6 6 6 6 6 6 6 6 6 1 1 1 1 1 1 1 1 1 1 1 1 1 1 1 1 1 1
symmnumber: 1
zpe: 725348.0 jmol-1
zpe.correction: 0.276270 hartree
zpe.thermalcorrener: 0.289846 hartree
zpe.thermalcorrenthalpy: 0.290791 hartree
zpe.thermalcorrgfe: 0.234643 hartree
zpe.sumelectzpe: -617.434473 hartree
zpe.sumelectthermal: -617.420897 hartree
zpe.sumelectthermalent: -617.419953 hartree
zpe.sumelectthermalfe: -617.476100 hartree
dipole: 0.0000 0.0123 0.0000
dipole: 0.0123
quadrupole: -136.0482 -79.7412 -82.4769
quadrupole: 0.0000 -12.6919 0.0000
quadrupole: -36.6261 19.6809 16.9452 0.0000 -12.6919 0.0000
hfenergy: -617.7107432 hartree
pointgroup: C01 [X(C12H18O2)]
dipole: -0.0000006 0.0048198 0.0000074 debye
polarizability: 164.8024415|-0.0001147|117.8543544|6.5344118|-0.0000101|98.3333719 unknown
InChI: InChI=1S/C12H18O2/c13-11-5-1-9(2-6-11)10-3-7-12(14)8-4-10/h9-10H,1-8H2
charge 0 multiplicity 1
32 atoms
O  -4.864436 -0.002432 -0.514902
O  4.864439 -0.002455 0.514897
C  -0.731879 0.003933 0.27898
C  0.731872 0.00393 -0.278973
C  -1.520949 1.26856 -0.158606
C  -1.517761 -1.263543 -0.155803
C  1.520948 1.268554 0.158612
C  1.517748 -1.263551 0.155807
C  -2.981851 1.285109 0.372369
C  -2.978491 -1.282834 0.375511
C  2.981851 1.285094 -0.372359
C  2.978479 -1.282845 -0.375503
C  -3.726102 -0.000273 0.025079
C  3.726091 -0.00029 -0.025054
H  -0.668243 0.005098 1.391479
H  0.668235 0.005096 -1.391472
H  -1.535741 1.31718 -1.267206
H  -1.018532 2.186152 0.195787
H  -1.012501 -2.17909 0.200042
H  -1.532781 -1.314254 -1.264292
H  1.535735 1.317179 1.267212
H  1.018537 2.186149 -0.195787
H  1.012485 -2.179095 -0.200042
H  1.532765 -1.314266 1.264296
H  -3.544644 2.14798 -0.023537
H  -2.956577 1.376032 1.47894
H  -2.952881 -1.37105 1.482294
H  -3.539003 -2.148138 -0.018311
H  3.544648 2.147964 0.023544
H  2.956581 1.37601 -1.47893
H  2.95287 -1.371051 -1.482287
H  3.538987 -2.148155 0.018313
