program: Gaussian 09
title: 000264835
version: EM64L-G09RevD.01
frameworkgroup: C1[X(C14H10N2O2)]
method: RPBEPBE
basis: SDD
operation: Freq
keyword: #p
keyword: freq=noraman
keyword: PBEPBE/SDD
title: #p freq=noraman PBEPBE/SDD
converged: YES YES NO YES
title: Mulliken charges:
elementType: O O N N C C C C C C C C C C C C C C H H H H H H H H H H
charge: -0.199377 -0.199477 -0.268382 -0.268392 0.481374 0.481356 0.117962 0.118134 -0.468334 -0.468314 -0.182638 -0.182669 -0.334423 -0.334421 -0.203223 -0.203223 -0.192961 -0.192966 0.252724 0.252718 0.264335 0.264355 0.250145 0.250147 0.239416 0.239419 0.243358 0.243359
chargesum: 0.00000
title: Mulliken charges with hydrogens summed into heavy atoms:
elementType: O O N N C C C C C C C C C C C C C C
charge: -0.199377 -0.199477 -0.268382 -0.268392 0.481374 0.481356 0.117962 0.118134 -0.215610 -0.215596 0.081696 0.081686 -0.084278 -0.084274 0.036194 0.036195 0.050397 0.050393
polarizability: 2.48530388e+02 -1.20532633e+01 1.71440346e+02 9.15170565e-04 -1.89726248e-03 1.49013308e+02
1716.lowfreq: -9.3100 -2.3140 0.0002 0.0006 0.0006 11.5289 42.3769 72.9808 92.2629
frequency: 42.3287 72.9797 92.2624 93.5488 123.7584 189.6818 211.8124 223.6479 274.2365 300.8941 321.0262 344.1814 395.2853 395.9986 452.7958 480.1688 499.7200 516.3762 568.2052 596.4977 633.4506 639.2600 655.3511 656.2161 663.7957 684.0714 727.9956 738.7668 753.0232 755.2260 777.6859 778.0764 835.8810 848.2947 867.4923 877.9223 937.1879 937.5820 986.5398 986.5765 1012.1072 1012.8573 1035.6662 1038.2169 1114.9339 1119.3016 1150.2667 1164.6452 1167.4827 1173.5214 1216.4627 1224.3013 1278.0593 1282.6937 1344.3882 1348.1778 1377.5684 1383.9314 1437.2416 1446.1429 1513.5646 1521.1077 1537.3683 1550.1835 1620.8439 1621.5376 1650.4483 1674.0746 3148.3281 3148.3705 3159.7942 3159.8917 3169.1494 3169.1649 3176.5332 3176.5549 3198.1089 3198.1692
redmass: 6.5552 5.7245 5.2728 4.7161 5.8895 6.5210 5.3219 5.8765 4.6352 6.0453 5.2752 4.2346 6.6059 4.6336 7.4431 4.8383 3.0968 2.9051 4.9541 5.6269 5.4223 3.2827 5.2547 4.0437 5.4816 3.1170 4.5659 2.3096 2.2236 1.5724 1.5107 1.6951 2.6635 1.7596 1.9865 2.9209 1.3848 1.3890 1.3448 1.3447 6.4599 6.1005 2.3786 2.3557 1.7661 1.7710 2.2450 2.1483 1.6726 1.4105 1.3609 1.3701 1.7397 1.6251 3.0572 3.5153 1.9094 1.9813 2.1529 2.1799 4.5772 4.9880 6.9296 6.7919 5.8430 5.9408 9.7602 10.0942 1.0873 1.0873 1.0888 1.0888 1.0938 1.0937 1.0925 1.0925 1.1013 1.1013
irintensity: 1.9098 0.2246 2.4294 1.4426 3.2163 8.3185 2.8701 0.7893 6.1872 0.5029 0.1461 5.7272 18.8992 8.2300 9.4499 14.3537 18.5069 36.1129 1.4442 40.7243 1.2040 37.1730 10.5995 0.1743 41.7128 10.3929 0.5499 2.1649 20.8549 4.8584 157.5963 59.3832 0.8897 1.3401 8.4894 25.1613 0.0524 0.8818 0.0575 2.2138 1.2911 47.9923 7.0930 11.1589 30.9404 4.8938 2.7688 50.5908 83.1991 25.8420 9.2974 47.4879 2.4585 7.6259 8.5459 4.8770 9.6266 9.1304 14.5487 3.9113 9.1787 1.8382 143.0972 203.0189 90.9592 76.7992 328.5632 1191.6160 7.2446 1.5804 0.0119 0.3898 18.3346 0.1243 4.7424 0.1560 7.8880 5.7121
temp: 298.150 k
press: 1.00000 atm
elementType: 8 8 7 7 6 6 6 6 6 6 6 6 6 6 6 6 6 6 1 1 1 1 1 1 1 1 1 1
symmnumber: 1
zpe: 542249.0 jmol-1
zpe.correction: 0.206532 hartree
zpe.thermalcorrener: 0.220535 hartree
zpe.thermalcorrenthalpy: 0.221480 hartree
zpe.thermalcorrgfe: 0.165632 hartree
zpe.sumelectzpe: -798.157424 hartree
zpe.sumelectthermal: -798.143420 hartree
zpe.sumelectthermalent: -798.142476 hartree
zpe.sumelectthermalfe: -798.198323 hartree
dipole: 0.0000 -0.0004 -7.3607
dipole: 7.3607
quadrupole: -88.4922 -98.5740 -112.1168
quadrupole: 12.9520 -0.0012 -0.0004
quadrupole: 11.2355 1.1537 -12.3891 12.9520 -0.0012 -0.0004
hfenergy: -798.3639553 hartree
pointgroup: C01 [X(C14H10N2O2)]
dipole: 0.0000074 -0.0001648 -2.8959301 debye
polarizability: 248.9494541|-10.6207198|171.0212798|0.0009501|-0.00188|149.0133081 unknown
InChI: InChI=1S/C14H10N2O2/c17-13-9-11-5-1-3-7-15(11)14(18)10-12-6-2-4-8-16(12)13/h1-10H
charge 0 multiplicity 1
28 atoms
O  1.602728 -1.895284 2.389682
O  -1.602945 1.895864 2.389033
N  1.4034 -0.456619 0.507638
N  -1.4033 0.456557 0.507593
C  1.558046 0.92499 0.689897
C  -1.558063 -0.92502 0.689831
C  0.750586 -1.374209 1.617917
C  -0.750593 1.37396 1.61806
C  0.627089 1.654276 1.47403
C  -0.627159 -1.65435 1.473988
C  2.180301 -1.158577 -0.397288
C  -2.180135 1.158607 -0.397317
C  2.693816 1.541012 0.058891
C  -2.693896 -1.540939 0.058837
C  3.205878 -0.545488 -1.106327
C  -3.205768 0.545621 -1.106361
C  3.496863 0.82932 -0.829296
C  -3.496867 -0.829175 -0.829358
H  0.977595 2.554515 1.987514
H  -0.977814 -2.554409 1.987686
H  1.963078 -2.226315 -0.474839
H  -1.962861 2.226341 -0.474795
H  2.869764 2.60268 0.25624
H  -2.869935 -2.60259 0.256197
H  3.794984 -1.123802 -1.821156
H  -3.794839 1.124009 -1.821159
H  4.338065 1.321861 -1.327588
H  -4.338117 -1.321634 -1.327648
