program: Gaussian 09
title: 000264823
version: EM64L-G09RevD.01
frameworkgroup: C1[X(C12H9N3O3)]
method: RPBEPBE
basis: SDD
operation: Freq
keyword: #p
keyword: freq=noraman
keyword: PBEPBE/SDD
title: #p freq=noraman PBEPBE/SDD
converged: YES YES NO NO
title: Mulliken charges:
elementType: O O O N N N C C C C C C C C C C C C H H H H H H H H H
charge: -0.270554 -0.210106 -0.207987 -0.090384 -0.077973 0.021928 0.194588 0.382383 0.386081 -0.335775 -0.267702 -0.337468 -0.341250 -0.316430 -0.361149 -0.194199 -0.192004 -0.230100 0.260828 0.314602 0.289351 0.288075 0.287062 0.291363 0.238170 0.239643 0.239008
chargesum: 0.00000
title: Mulliken charges with hydrogens summed into heavy atoms:
elementType: O O O N N N C C C C C C C C C C C C
charge: -0.270554 -0.210106 -0.207987 -0.090384 -0.077973 0.021928 0.194588 0.382383 0.386081 -0.074947 0.046901 -0.048117 -0.053174 -0.029369 -0.069786 0.043972 0.047639 0.008908
polarizability: 3.97308815e+02 -8.13320321e+00 1.70082970e+02 -6.17036050e-03 -4.14879375e-02 5.96153379e+01
1716.lowfreq: -1.1386 -0.0008 -0.0008 -0.0006 6.4620 10.3903 33.2570 34.3437 60.5393
frequency: 32.8917 34.2828 60.5375 77.2873 80.3244 129.7633 175.8561 197.9835 220.7988 299.5289 328.2277 367.7643 406.9305 408.0450 417.0334 452.2090 473.2005 510.1662 520.0173 607.3911 612.0544 627.8973 654.9108 666.1157 681.9793 688.5059 747.8081 768.7824 783.9218 823.8640 845.5361 854.3258 854.8353 876.6231 953.7146 989.2951 994.3154 994.5574 995.8601 1003.8255 1008.1100 1018.0539 1073.4480 1080.1810 1093.3272 1110.3079 1163.8203 1172.4238 1173.8745 1208.7587 1220.1473 1224.1466 1292.4730 1306.9953 1346.6380 1359.9585 1396.8464 1400.1863 1424.1848 1451.0306 1460.8000 1467.6466 1570.2030 1599.0517 1600.6903 1603.6466 3139.7669 3153.0301 3167.4331 3168.3543 3178.8263 3188.6855 3191.1195 3196.5552 3226.8325
redmass: 5.9810 5.4405 9.4878 6.3269 6.7707 7.3015 8.0643 5.7992 8.7784 5.5432 6.3424 8.7977 2.8876 8.7163 2.9714 3.7382 8.1819 7.1140 3.4177 7.6338 6.6394 7.6758 6.0962 4.4347 7.2680 1.9964 4.6773 9.3911 1.7146 6.9039 1.2464 9.5956 1.2487 1.6586 1.3999 6.2483 1.3708 3.0173 1.3393 1.3517 1.3246 2.3248 2.6851 1.7051 2.9989 1.3027 1.3536 1.4106 1.0577 3.2099 4.5122 5.9759 1.3438 1.3887 6.3325 8.5529 9.2713 8.2081 4.6933 2.3804 2.2385 2.3760 7.8591 6.2695 6.5963 7.0065 1.0862 1.0910 1.0894 1.0968 1.0916 1.0954 1.0967 1.0957 1.0938
irintensity: 0.0012 0.0656 1.2337 2.3757 0.2613 1.1597 2.0747 1.4124 1.6333 2.3780 0.2113 8.5210 0.0017 11.1471 0.0526 0.0504 2.1318 1.1235 15.5407 0.6769 1.3715 0.1950 18.2959 18.9190 14.8844 52.7732 1.5229 28.7126 56.2786 6.9710 0.4332 10.0896 0.1263 82.8003 9.6710 2.7589 0.0011 0.6272 0.4078 0.0103 1.1660 14.8367 41.6883 8.7587 20.9590 22.8548 7.0724 227.3501 0.0982 277.4372 277.9605 32.5566 3.1136 3.8310 180.9238 76.9605 15.8990 60.1086 33.4918 21.2871 4.2061 44.7267 14.4456 21.4191 18.2539 3.7914 0.0489 14.7851 1.8583 26.6054 0.7567 5.1367 1.2071 7.3739 2.2184
temp: 298.150 k
press: 1.00000 atm
elementType: 8 8 8 7 7 7 6 6 6 6 6 6 6 6 6 6 6 6 1 1 1 1 1 1 1 1 1
symmnumber: 1
zpe: 506358.4 jmol-1
zpe.correction: 0.192862 hartree
zpe.thermalcorrener: 0.207294 hartree
zpe.thermalcorrenthalpy: 0.208238 hartree
zpe.thermalcorrgfe: 0.149432 hartree
zpe.sumelectzpe: -851.195389 hartree
zpe.sumelectthermal: -851.180956 hartree
zpe.sumelectthermalent: -851.180012 hartree
zpe.sumelectthermalfe: -851.238819 hartree
dipole: 7.7500 1.5526 0.0082
dipole: 7.9040
quadrupole: -116.2792 -96.4092 -106.2432
quadrupole: 2.0958 0.0695 0.0439
quadrupole: -9.9687 9.9013 0.0674 2.0958 0.0695 0.0439
hfenergy: -851.3882505 hartree
pointgroup: C01 [X(C12H9N3O3)]
dipole: -3.0604026 -0.0272101 0.5507822 debye
polarizability: 396.8798698|-3.9172324|60.7579036|12.2650021|-11.0932556|169.3693496 unknown
InChI: InChI=1S/C12H9N3O3/c16-14(11-4-2-1-3-5-11)13-10-6-8-12(9-7-10)15(17)18/h1-9H
charge 0 multiplicity 1
27 atoms
O  -1.247639 0.151959 -1.894235
O  5.649961 -0.21628 1.23973
O  5.625679 0.032362 -1.0295
N  -1.523539 0.027843 -0.61161
N  -0.658629 -0.078712 0.389245
N  5.031065 -0.088776 0.111632
C  0.734072 -0.065048 0.158211
C  -2.945524 0.002925 -0.223134
C  3.550882 -0.080897 0.130211
C  1.480129 -0.200516 1.373661
C  1.441361 0.063752 -1.08307
C  2.87965 -0.209914 1.369484
C  2.847628 0.055223 -1.086394
C  -3.320645 -0.11674 1.135325
C  -3.905997 0.105367 -1.2538
C  -4.692518 -0.132468 1.459064
C  -5.274295 0.087402 -0.911813
C  -5.671084 -0.030838 0.440868
H  0.918924 -0.296893 2.307483
H  0.887661 0.167812 -2.014617
H  3.460509 -0.313085 2.289116
H  3.410058 0.152311 -2.018839
H  -2.547431 -0.193439 1.90194
H  -3.569021 0.196788 -2.289073
H  -4.998516 -0.224054 2.506361
H  -6.029114 0.166001 -1.700904
H  -6.734928 -0.04379 0.700858
