program: Gaussian 09
title: 000264822
version: EM64L-G09RevD.01
frameworkgroup: C1[X(C12H9N3O3)]
method: RPBEPBE
basis: SDD
operation: Freq
keyword: #p
keyword: freq=noraman
keyword: PBEPBE/SDD
title: #p freq=noraman PBEPBE/SDD
converged: YES YES NO NO
title: Mulliken charges:
elementType: O O O N N N C C C C C C C C C C C C H H H H H H H H H
charge: -0.284832 -0.201660 -0.201288 -0.095485 -0.084446 0.023536 0.404030 -0.297836 -0.352905 0.399775 -0.335476 -0.337116 0.198628 -0.350850 -0.305311 -0.198740 -0.201389 -0.230067 0.296638 0.302778 0.291767 0.292574 0.252053 0.309443 0.235614 0.234407 0.236160
chargesum: 0.00000
title: Mulliken charges with hydrogens summed into heavy atoms:
elementType: O O O N N N C C C C C C C C C C C C
charge: -0.284832 -0.201660 -0.201288 -0.095485 -0.084446 0.023536 0.404030 -0.001198 -0.050128 0.399775 -0.043709 -0.044542 0.198628 -0.098797 0.004131 0.036874 0.033018 0.006093
polarizability: 3.84216156e+02 1.55649940e+01 1.72926549e+02 -1.41631043e-01 4.79228426e-02 5.94724375e+01
1716.lowfreq: -5.8085 -2.1650 -0.0007 -0.0004 0.0005 4.1985 30.7059 36.7217 66.2425
frequency: 30.6922 36.7158 66.2424 74.9566 92.0850 100.0785 192.5048 208.5297 226.7501 296.1606 313.7891 354.0145 400.1156 409.0420 415.5775 456.8687 494.8682 521.5550 525.8987 581.4713 609.9878 621.7912 633.1418 667.9172 688.7717 689.2807 742.1272 781.0488 782.3361 816.1495 848.9303 853.2766 856.1336 885.9994 941.1664 981.8831 987.7078 998.9684 1003.1556 1004.8209 1009.6760 1020.1473 1071.6507 1087.0006 1091.4453 1102.5367 1158.4511 1172.3712 1179.5888 1209.2427 1213.6741 1219.1871 1282.8192 1314.1343 1348.7684 1368.7465 1396.7329 1409.7546 1431.5069 1440.3532 1459.1110 1466.3781 1563.7030 1598.9150 1602.4067 1606.2295 3134.0933 3145.5995 3159.7063 3173.3758 3180.8788 3182.4415 3197.1500 3204.1766 3218.3419
redmass: 6.1508 5.4473 6.7190 6.9808 9.0087 6.1941 7.2044 8.8986 6.3284 6.0047 5.9443 9.0088 8.0131 2.8922 2.9549 3.8624 9.6489 6.4621 3.3612 7.5348 6.4982 7.1482 6.8740 4.5003 8.2917 1.8094 5.1440 9.0252 1.7969 6.5919 1.2453 9.9944 1.2397 1.6040 1.4268 6.0538 1.3710 3.0692 1.3248 1.3310 1.3566 2.2115 3.1082 1.6508 3.3688 1.2671 1.3725 1.0683 1.2110 5.4334 4.9942 4.7654 1.2707 1.3909 7.2757 10.0658 7.8201 7.2939 5.2866 2.4707 2.2168 2.3824 5.7254 6.3302 6.4002 8.4708 1.0857 1.0899 1.0949 1.1000 1.0894 1.0901 1.0963 1.0962 1.0940
irintensity: 0.0004 0.0609 0.0636 0.0678 4.8284 2.0317 3.6801 3.0002 0.3672 0.1553 0.1921 3.9675 22.1397 0.1103 0.0005 0.2206 5.5941 1.3389 17.4497 2.5944 0.1410 0.2536 0.0183 32.7915 3.8682 52.2473 0.8462 34.1798 63.5192 18.4526 0.0530 8.2081 0.0740 77.8180 11.5925 4.3398 0.1281 9.2079 0.0789 0.9353 0.0169 6.3370 13.1735 5.1175 30.3564 32.5188 2.4363 2.5110 50.2441 74.6519 230.9811 248.6516 0.1184 2.6620 53.7973 64.0098 8.7379 21.7532 61.0658 4.0769 5.4126 22.3160 5.6910 83.9971 1.2954 4.4589 0.5002 10.8544 26.6806 26.2164 1.7872 2.0227 1.6082 0.2044 5.7548
temp: 298.150 k
press: 1.00000 atm
elementType: 8 8 8 7 7 7 6 6 6 6 6 6 6 6 6 6 6 6 1 1 1 1 1 1 1 1 1
symmnumber: 1
zpe: 506097.0 jmol-1
zpe.correction: 0.192762 hartree
zpe.thermalcorrener: 0.207203 hartree
zpe.thermalcorrenthalpy: 0.208147 hartree
zpe.thermalcorrgfe: 0.149343 hartree
zpe.sumelectzpe: -851.193028 hartree
zpe.sumelectthermal: -851.178587 hartree
zpe.sumelectthermalent: -851.177643 hartree
zpe.sumelectthermalfe: -851.236447 hartree
dipole: -5.6870 -0.7138 0.0005
dipole: 5.7317
quadrupole: -116.2850 -97.3072 -106.2381
quadrupole: 7.9099 -0.0695 0.0708
quadrupole: -9.6749 9.3029 0.3720 7.9099 -0.0695 0.0708
hfenergy: -851.3857902 hartree
pointgroup: C01 [X(C12H9N3O3)]
dipole: -2.2410945 -0.1430003 -0.205219 debye
polarizability: 384.5905076|8.6441132|89.7169437|9.5117112|50.0317164|142.3076914 unknown
InChI: InChI=1S/C12H9N3O3/c16-14(13-10-4-2-1-3-5-10)11-6-8-12(9-7-11)15(17)18/h1-9H
charge 0 multiplicity 1
27 atoms
O  -0.971882 1.026958 1.717979
O  5.344164 -0.840308 -1.437848
O  5.785207 0.337181 0.466103
N  -0.647437 0.367815 0.617992
N  -1.459973 -0.175215 -0.274854
N  4.972004 -0.194041 -0.384022
C  0.78946 0.207753 0.332236
C  1.226564 -0.493813 -0.816304
C  1.701968 0.778979 1.247494
C  3.514434 -0.05315 -0.134183
C  2.605911 -0.626336 -1.052468
C  3.082838 0.647945 1.012462
C  -2.86386 -0.103805 -0.133058
C  -3.547942 -0.746259 -1.213765
C  -3.628019 0.504234 0.915821
C  -4.951053 -0.784153 -1.253761
C  -5.036341 0.45418 0.858373
C  -5.703917 -0.182286 -0.214263
H  0.486112 -0.91836 -1.495904
H  1.312901 1.310107 2.118836
H  2.988782 -1.160011 -1.925803
H  3.823523 1.07378 1.693699
H  -2.942923 -1.203725 -2.002893
H  -3.11726 0.995712 1.742876
H  -5.460473 -1.278562 -2.087492
H  -5.61817 0.919034 1.661836
H  -6.798717 -0.210051 -0.241586
