program: Gaussian 09
title: 000264828
version: EM64L-G09RevD.01
frameworkgroup: C1[X(C12H20O3)]
method: RPBEPBE
basis: SDD
operation: Freq
keyword: #pfreq=noraman
keyword: PBEPBE/SDD
title: #p freq=noraman PBEPBE/SDD
converged: NO YES NO NO
title: Mulliken charges:
elementType: O O O C C C C C C C C C C C C H H H H H H H H H H H H H H H H H H H H
charge: -0.273988 -0.308511 -0.237649 0.401515 -0.047666 -0.486713 -0.453200 -0.397455 -0.451977 -0.378270 -0.410873 -0.402152 -0.368604 0.305058 -0.767911 0.213165 0.204663 0.229023 0.273603 0.193514 0.216832 0.181268 0.204389 0.211051 0.193845 0.223151 0.204809 0.194195 0.201537 0.194143 0.192024 0.217122 0.246400 0.243036 0.240626
chargesum: 0.00000
title: Mulliken charges with hydrogens summed into heavy atoms:
elementType: O O O C C C C C C C C C C C C
charge: -0.273988 -0.308511 -0.237649 0.401515 0.165499 -0.053027 0.013918 0.000645 -0.036537 0.038726 -0.011868 -0.006472 0.040542 0.305058 -0.037850
polarizability: 1.46503983e+02 -1.79850478e+00 1.34678615e+02 1.78632188e+00 -1.88534496e+00 1.17521170e+02
1716.lowfreq: -13.5237 -0.0008 -0.0007 -0.0006 14.2654 18.7682 58.0150 73.8205 84.4501
frequency: 58.0033 73.7907 84.4160 90.2613 152.9320 167.0429 175.6799 207.8855 252.1522 276.8547 282.3583 303.6058 328.0826 343.3768 370.1112 400.9326 406.8022 434.5453 479.1082 525.9171 546.4652 564.0083 603.5650 645.3826 666.3332 730.2575 767.1353 790.9975 811.2314 835.5928 856.0132 867.7284 890.0506 908.1518 930.4547 964.5672 981.0583 982.1332 1003.1360 1009.2119 1021.2298 1039.1035 1054.8886 1085.3694 1103.8375 1120.2370 1127.6559 1131.2642 1178.7364 1182.1501 1187.5333 1212.8959 1226.2502 1250.8599 1261.4130 1275.0814 1285.7405 1304.1922 1336.4045 1341.5445 1344.9285 1347.1633 1350.2922 1351.6895 1354.9344 1362.7137 1371.2270 1377.9269 1448.3607 1452.6436 1453.0328 1454.3105 1455.6414 1466.2279 1467.8916 1469.9702 1476.1132 1484.4637 1656.7392 2962.8077 2966.2915 2971.3751 2975.7684 2985.1064 2985.5906 2994.5409 3002.0253 3003.9724 3007.5134 3017.7219 3023.4576 3034.3818 3035.1478 3043.9863 3047.3074 3064.6550 3082.4727 3096.5814 3137.4546
redmass: 1.8188 1.6661 4.2714 3.3760 2.6388 3.0949 3.5429 2.7058 3.7842 2.7265 3.2785 3.2047 2.6914 2.1467 2.2121 3.4594 2.7855 2.6477 1.9529 2.0245 2.8538 3.2130 2.9455 5.1319 2.6740 3.4487 2.2022 2.4884 2.4447 1.6545 2.1126 1.7320 4.1029 2.2709 2.2275 2.7813 2.1250 2.1477 2.0323 1.9849 2.1328 1.6636 2.0309 2.0419 1.9981 1.8996 2.0592 2.1291 1.5343 2.6510 1.4196 1.7926 1.3774 1.2490 1.2418 1.3274 1.3212 1.2302 1.3775 1.4530 1.4285 1.4500 1.4600 1.3636 1.4070 1.3131 1.3964 1.2380 1.0839 1.0799 1.0615 1.0517 1.0866 1.0809 1.0844 1.0889 1.0848 1.0817 9.8205 1.0607 1.0621 1.0634 1.0629 1.0625 1.0635 1.0657 1.0850 1.0371 1.0649 1.0947 1.0968 1.0998 1.0993 1.1004 1.1001 1.0991 1.0973 1.0954 1.1021
irintensity: 3.7229 0.7726 0.6327 1.0871 0.2449 1.6811 1.2629 4.5699 1.5038 1.8707 1.2757 1.0558 0.9192 3.1687 5.0764 0.4593 1.1509 3.8267 1.9584 0.3725 4.3155 6.7746 0.6050 2.2811 2.5130 18.6416 1.9117 6.6538 16.8520 8.9990 0.9945 24.6514 93.5509 103.9018 2.3626 17.4062 35.8734 159.7239 18.0221 15.0548 26.4992 9.7443 2.0552 40.4945 47.6901 9.1097 19.6481 33.3392 6.7640 289.4859 39.5772 18.2611 3.8004 0.4897 0.2900 1.4500 10.4350 0.0783 6.6661 0.8212 2.4338 3.6082 10.9192 0.7277 8.4593 12.0141 0.4743 50.6181 9.0073 12.0211 16.5608 21.6708 7.3360 4.2686 15.4634 1.8214 10.3648 31.0154 196.4478 19.7822 28.8659 24.7155 35.2014 53.8256 23.1333 21.8665 30.9021 3.9885 24.2942 41.6783 54.9612 91.2829 10.0228 59.0481 44.5343 46.3308 9.9259 10.6542 12.9658
temp: 298.150 k
press: 1.00000 atm
elementType: 8 8 8 6 6 6 6 6 6 6 6 6 6 6 6 1 1 1 1 1 1 1 1 1 1 1 1 1 1 1 1 1 1 1 1
symmnumber: 1
zpe: 795984.1 jmol-1
zpe.correction: 0.303174 hartree
zpe.thermalcorrener: 0.317945 hartree
zpe.thermalcorrenthalpy: 0.318889 hartree
zpe.thermalcorrgfe: 0.262323 hartree
zpe.sumelectzpe: -693.747963 hartree
zpe.sumelectthermal: -693.733193 hartree
zpe.sumelectthermalent: -693.732249 hartree
zpe.sumelectthermalfe: -693.788814 hartree
dipole: -2.3939 -1.4705 1.7563
dipole: 3.3133
quadrupole: -86.0373 -90.0672 -91.3861
quadrupole: -6.0994 4.5678 3.5459
quadrupole: 3.1263 -0.9037 -2.2225 -6.0994 4.5678 3.5459
hfenergy: -694.0511374 hartree
pointgroup: C01 [X(C12H20O3)]
dipole: -0.997643 -0.500045 0.6736968 debye
polarizability: 146.0206441|-2.9535937|135.2374511|1.6618495|-1.6245505|117.4456737 unknown
InChI: InChI=1S/C12H20O3/c1-10(13)14-12-8-4-2-6-11(15-12)7-3-5-9-12/h11H,2-9H2,1H3
charge 0 multiplicity 1
35 atoms
O  -0.026194 0.130637 -0.813841
O  1.732702 -0.519562 0.563353
O  2.862186 0.943088 -0.913187
C  0.404143 0.200783 0.576852
C  -1.468931 0.121363 -1.180116
C  -0.40528 -0.648671 1.583598
C  0.601996 1.673092 1.003533
C  -2.028715 -1.319683 -1.158898
C  -2.32615 1.172428 -0.434588
C  -0.87193 -2.029349 1.06344
C  -0.703928 2.500474 1.106536
C  -2.176294 -1.981805 0.230006
C  -1.592879 2.511811 -0.164188
C  2.800189 -0.117058 -0.257862
C  3.873683 -1.189637 -0.220528
H  -1.404934 0.438622 -2.239385
H  -1.277472 -0.07262 1.94083
H  0.259416 -0.785759 2.456711
H  1.269813 2.133594 0.256896
H  1.124325 1.690374 1.980687
H  -1.353222 -1.936292 -1.783228
H  -3.01574 -1.311568 -1.667389
H  -2.714232 0.771913 0.521279
H  -3.215898 1.359545 -1.068798
H  -1.042212 -2.68728 1.93825
H  -0.05693 -2.489562 0.472885
H  -0.406078 3.541993 1.338729
H  -1.316802 2.160461 1.966797
H  -2.54116 -3.016873 0.07571
H  -2.962583 -1.46757 0.820298
H  -2.351523 3.310066 -0.043421
H  -0.977971 2.783315 -1.04472
H  3.575804 -2.024003 -0.881532
H  3.988121 -1.596181 0.797278
H  4.826383 -0.773788 -0.58089
