program: Gaussian 09
title: 000264870
version: EM64L-G09RevD.01
frameworkgroup: C1[X(C21H26O)]
method: RPBEPBE
basis: SDD
operation: Freq
keyword: #pfreq=noraman
keyword: PBEPBE/SDD
title: #p freq=noraman PBEPBE/SDD
converged: YES YES NO NO
title: Mulliken charges:
elementType: O C C C C C C C C C C C C C C C C C C C C C H H H H H H H H H H H H H H H H H H H H H H H H H H
charge: -0.210317 -0.569957 0.222700 -0.544499 0.344546 0.320648 0.071396 0.058537 0.355400 0.326353 -0.628433 -0.615654 0.480845 -0.852548 -0.849241 0.485308 -0.586560 -0.611646 -0.818881 -0.839611 -0.817006 -0.814506 0.221383 0.260407 0.252681 0.253313 0.232585 0.232828 0.231896 0.234468 0.222184 0.238392 0.230433 0.229347 0.238807 0.238154 0.266696 0.220691 0.221333 0.236371 0.235972 0.228780 0.222583 0.221826 0.233033 0.235730 0.224798 0.228437
chargesum: 0.00000
title: Mulliken charges with hydrogens summed into heavy atoms:
elementType: O C C C C C C C C C C C C C C C C C C C C C
charge: -0.210317 -0.088167 0.222700 -0.038506 0.344546 0.320648 0.071396 0.058537 0.355400 0.326353 -0.395848 -0.382825 0.480845 -0.164001 -0.151069 0.485308 -0.347753 -0.373492 -0.110160 -0.138490 -0.139564 -0.125540
polarizability: 3.11668277e+02 6.10968878e+00 2.41601794e+02 4.82764527e-01 4.06531526e+00 1.55188184e+02
1716.lowfreq: -23.2242 -5.5018 -2.3770 -0.0003 0.0003 0.0005 3.8153 6.0215 23.7518
frequency: -23.1617 3.6404 23.7083 29.0858 41.4570 50.2185 59.6638 92.6475 122.8388 130.0923 134.7831 149.9116 159.3066 171.5548 172.5376 187.2908 212.3287 219.5072 228.0997 237.6968 269.4525 275.7056 288.0973 307.6305 324.3261 344.8959 380.7581 419.6054 471.9266 486.7220 490.6218 515.5764 520.1796 522.6457 537.9461 541.6939 562.0363 562.3451 574.1486 600.8002 622.4742 715.8945 736.5177 757.0785 771.4232 827.0553 865.7377 866.4538 894.5194 897.9750 906.8155 933.9765 947.3763 957.0505 971.7754 990.4658 1013.6713 1016.4822 1017.7707 1019.5587 1022.7053 1035.7501 1040.1839 1041.9689 1044.4790 1044.6693 1049.8512 1051.0269 1056.3274 1142.5244 1150.4818 1166.5164 1218.2708 1220.1087 1243.6301 1255.8314 1264.6002 1292.0241 1309.7048 1315.2025 1330.1014 1360.2426 1368.7990 1394.6612 1396.5616 1396.7874 1399.1865 1401.2759 1402.1699 1413.1431 1415.2424 1434.2174 1441.5975 1445.6507 1462.9666 1470.4736 1471.8868 1472.6594 1473.1314 1475.0474 1475.6973 1478.7110 1481.5690 1484.1466 1487.5540 1489.1435 1502.8210 1569.0126 1587.9083 1590.6175 1616.9612 1621.2826 2967.8530 2970.4584 2971.9675 2973.0243 2973.7290 2976.5431 2986.3894 3005.6551 3044.8671 3047.3585 3052.3756 3055.8867 3056.1725 3058.6706 3069.6030 3077.7453 3080.3024 3081.1837 3081.9336 3085.5264 3087.8414 3091.3878 3107.5303 3112.0671 3113.0537 3117.5617
redmass: 1.0177 4.1182 3.7865 3.9058 1.0507 4.5284 3.5127 3.1798 2.4047 1.1477 1.1166 1.1432 1.2044 2.9451 3.8351 2.3006 3.0777 3.2421 2.7401 3.3311 2.5116 2.5857 3.7322 2.7596 2.9765 2.4572 4.4715 3.4475 4.7054 3.2570 2.7388 4.3314 3.0575 3.0439 4.3165 3.9118 4.0135 3.9676 3.2094 3.2073 2.8769 4.5957 3.2916 2.9038 1.6255 4.0730 1.3128 1.2978 1.3132 1.3118 2.5647 2.5008 3.0568 3.4673 4.2498 1.5566 1.6910 1.6486 1.6886 1.6131 2.1091 1.5629 1.5657 1.5790 1.8318 1.6394 1.6559 1.6630 2.1635 1.4271 2.5070 1.7389 1.7281 1.6713 1.4522 1.4223 1.3869 1.4689 5.3080 6.3337 1.5664 7.2301 4.9947 1.2565 1.2536 1.2333 1.2700 1.2668 1.2646 2.3227 2.4806 1.4627 1.4766 1.4914 1.0591 1.0527 1.0767 1.0602 1.0546 1.0674 1.1122 1.1406 1.1669 1.0867 1.5628 1.3247 1.1997 7.0845 7.5616 7.1559 5.9061 6.0471 1.0677 1.0381 1.0386 1.0408 1.0381 1.0378 1.0374 1.0614 1.0965 1.0965 1.0950 1.0932 1.0962 1.0950 1.0962 1.0963 1.0980 1.0996 1.0969 1.0993 1.0992 1.1002 1.0908 1.0916 1.0910 1.0918
irintensity: 0.4522 0.5043 0.0424 0.3832 0.3217 2.0143 0.7062 3.2041 0.7114 0.5764 1.3339 0.1932 1.3232 1.9935 3.7780 5.4738 1.6597 0.2662 0.1053 6.3491 0.6998 2.1893 2.4290 0.4284 0.0862 0.2150 2.6087 4.2808 2.1132 3.4385 0.1029 3.1147 2.2427 0.0257 2.4407 1.2692 0.7928 0.2306 4.6041 15.3418 3.0722 3.0341 6.6264 1.7465 7.1809 0.8795 27.5296 11.8016 0.0155 0.2443 0.2894 1.5355 7.0105 0.1053 37.7522 2.9847 12.2249 5.6153 1.0011 4.3696 12.2138 1.0402 1.6343 2.6655 0.9685 0.5197 32.7042 32.7984 6.8141 4.8347 0.3787 22.4264 0.0834 15.0115 53.3205 8.1446 32.7616 29.3201 9.9464 0.5572 36.6807 0.2241 0.6953 8.6957 12.8675 7.2520 21.6234 0.3991 16.6347 5.5675 1.5576 45.8461 13.3356 4.8452 15.7649 9.3263 17.8172 0.3927 10.4200 13.9343 12.9530 14.4681 45.5452 17.7534 39.8523 26.4925 10.8873 47.4640 46.9194 63.4779 59.0363 15.1293 5.4578 44.4281 48.7662 38.0450 17.5625 33.5403 22.9413 25.9291 19.9703 21.4059 24.8401 11.2281 27.4936 9.6727 20.2573 35.2497 44.1362 18.4751 2.7883 16.3211 12.4948 16.7518 34.3778 20.9658 26.9511 18.9202
temp: 298.150 k
press: 1.00000 atm
elementType: 8 6 6 6 6 6 6 6 6 6 6 6 6 6 6 6 6 6 6 6 6 6 1 1 1 1 1 1 1 1 1 1 1 1 1 1 1 1 1 1 1 1 1 1 1 1 1 1
symmnumber: 1
zpe: 1065737.1 jmol-1
zpe.correction: 0.405918 hartree
zpe.thermalcorrener: 0.429351 hartree
zpe.thermalcorrenthalpy: 0.430295 hartree
zpe.thermalcorrgfe: 0.349783 hartree
zpe.sumelectzpe: -889.457589 hartree
zpe.sumelectthermal: -889.434156 hartree
zpe.sumelectthermalent: -889.433212 hartree
zpe.sumelectthermalfe: -889.513723 hartree
dipole: -0.8347 -2.0444 1.8124
dipole: 2.8568
quadrupole: -118.5212 -125.6091 -138.1663
quadrupole: 3.7405 -3.2031 6.8390
quadrupole: 8.9110 1.8231 -10.7341 3.7405 -3.2031 6.8390
hfenergy: -889.8635064 hartree
pointgroup: C01 [X(C21H26O1)]
dipole: -0.3500621 0.8199192 -0.6844353 debye
polarizability: 312.0260685|-3.4910028|240.7593672|1.2320248|7.5270685|155.6728198 unknown
InChI: InChI=1S/C21H26O/c1-13-9-15(3)19(16(4)10-13)7-8-20(22)21-17(5)11-14(2)12-18(21)6/h9-12H,7-8H2,1-6H3
charge 0 multiplicity 1
48 atoms
O  -1.11328 -1.945052 1.435044
C  1.279199 -0.291138 1.152133
C  2.626112 0.004786 0.505203
C  0.118587 -0.321031 0.115347
C  3.093067 1.347107 0.370692
C  3.423712 -1.064872 -0.006386
C  -2.498525 -0.423227 0.160607
C  -1.173371 -0.945531 0.660032
C  -3.411612 -1.336465 -0.461205
C  -2.857136 0.948807 0.32298
C  4.330284 1.597101 -0.272006
C  4.653782 -0.775475 -0.644912
C  5.130082 0.549687 -0.786416
C  2.295391 2.524415 0.914041
C  2.985911 -2.515464 0.134481
C  -5.013963 0.51831 -0.81155
C  -4.640327 -0.841712 -0.951673
C  -4.113114 1.39098 -0.16013
C  -3.088428 -2.813736 -0.619895
C  -1.966061 1.953455 1.043644
C  6.468895 0.83453 -1.446418
C  -6.356532 1.01068 -1.32173
H  1.042053 0.464573 1.923632
H  1.288489 -1.268721 1.664627
H  0.417651 -0.964825 -0.739966
H  -0.070008 0.675163 -0.317066
H  4.677101 2.633905 -0.372057
H  5.255828 -1.605212 -1.037917
H  2.210206 2.486271 2.017436
H  2.780492 3.480396 0.652857
H  1.264853 2.552131 0.512782
H  2.951779 -2.828434 1.19573
H  1.975305 -2.695644 -0.277278
H  3.686552 -3.188529 -0.388562
H  -5.328423 -1.537278 -1.448793
H  -4.394196 2.442106 -0.015955
H  -3.060762 -3.317494 0.361715
H  -3.843581 -3.311091 -1.252033
H  -2.096339 -2.976209 -1.080488
H  -1.341495 1.482791 1.821948
H  -2.581539 2.727464 1.534437
H  -1.288995 2.478384 0.341377
H  6.689987 0.10393 -2.244926
H  6.494702 1.845062 -1.891279
H  7.296541 0.777401 -0.712336
H  -7.184341 0.639164 -0.687363
H  -6.409519 2.11288 -1.326823
H  -6.551516 0.654263 -2.349682
