program: Gaussian 09
title: 000264848
version: EM64L-G09RevD.01
frameworkgroup: C1[X(C16H23NO4)]
method: RPBEPBE
basis: SDD
operation: Freq
keyword: #p
keyword: freq=noraman
keyword: PBEPBE/SDD
title: #p freq=noraman PBEPBE/SDD
converged: YES YES NO NO
title: Mulliken charges:
elementType: O O O O N C C C C C C C C C C C C C C C C H H H H H H H H H H H H H H H H H H H H H H H
charge: -0.263150 -0.263180 -0.255388 -0.255390 -0.141946 -0.456979 -0.457171 0.446532 -0.502294 -0.502410 -0.375846 -0.375981 0.268241 0.268443 -0.241599 -0.241482 -0.270566 -0.263133 -0.263145 -0.664178 -0.664345 0.259144 0.231057 0.259251 0.231121 0.266016 0.248808 0.266197 0.248854 0.243514 0.243406 0.220688 0.220666 0.225911 0.234949 0.223925 0.234857 0.223913 0.218277 0.249400 0.228558 0.218306 0.249590 0.228558
chargesum: 0.00000
title: Mulliken charges with hydrogens summed into heavy atoms:
elementType: O O O O N C C C C C C C C C C C C C C C C
charge: -0.263150 -0.263180 -0.255388 -0.255390 -0.141946 0.033222 0.033202 0.446532 0.012531 0.012641 -0.132332 -0.132575 0.268241 0.268443 -0.020911 -0.020816 -0.044655 0.195741 0.195625 0.032057 0.032109
polarizability: 2.37971312e+02 1.50873543e-01 2.33652364e+02 1.37661157e+01 -5.29102381e-02 1.36359540e+02
1716.lowfreq: -6.9221 -6.0209 -4.7420 -0.0009 -0.0004 0.0006 15.0944 22.4497 24.5111
frequency: 14.9469 21.9138 24.4363 25.8207 28.3072 48.8160 58.1315 65.1175 76.7912 86.5411 117.0996 119.0610 154.3953 168.8280 185.5076 196.9908 223.6282 227.6226 282.1271 295.2161 304.1609 332.8451 365.9687 391.3686 391.4566 422.3313 452.1151 454.8688 506.7795 534.6068 538.3258 588.6576 595.1431 614.0833 664.5654 686.1260 698.3636 734.2455 753.3052 771.3256 783.8259 791.9383 802.1330 817.0614 817.2491 821.1086 875.1596 901.5422 907.6616 957.6535 966.6838 977.0591 977.2593 1002.0254 1002.5579 1019.7973 1022.9699 1030.2348 1034.5687 1072.3224 1090.8468 1096.2287 1096.3339 1107.9684 1148.3768 1156.3713 1156.5659 1173.5707 1192.5038 1205.8720 1208.0558 1232.5352 1271.3437 1278.2630 1278.7988 1278.8461 1303.1334 1309.3825 1340.4863 1351.1199 1351.8934 1359.0031 1359.5042 1380.9268 1390.0715 1392.0338 1392.1988 1445.2887 1448.3847 1451.7262 1456.8765 1456.8985 1464.4875 1464.6687 1484.9554 1485.0777 1488.6992 1497.9356 1512.5462 1577.1668 1618.5940 1627.1321 1628.4276 2993.3606 2993.3853 2999.6063 3003.0068 3009.4582 3011.2594 3029.5543 3029.6088 3055.2206 3060.5788 3088.5821 3088.6427 3091.5483 3092.7274 3093.4822 3093.5712 3119.5619 3119.6291 3122.3450 3128.9157 3152.0024 3156.9206 3168.8814
redmass: 4.6194 4.5085 4.1534 5.6103 5.5223 3.4290 3.3263 3.4975 3.4922 3.7415 3.3739 3.3821 3.7960 3.1636 4.0957 2.8048 1.2722 1.4664 2.9632 2.5113 2.4172 3.7563 3.0522 3.6807 2.9443 2.9940 3.4063 3.4568 2.9677 4.1069 3.5064 3.4926 3.7545 6.3451 4.3426 3.6267 1.9467 3.1063 1.8233 1.5370 1.9091 1.7194 1.8754 1.4567 1.5940 1.2503 1.4542 3.4704 3.5300 1.5194 2.8253 5.0648 1.2900 3.5153 3.4476 2.6369 3.2705 2.3282 2.5062 2.0290 2.0856 2.1665 1.9266 1.9944 2.7766 1.6702 1.6945 1.0663 1.9843 1.1366 1.5489 1.7175 1.2837 1.3539 1.1187 1.1190 1.5067 1.3269 1.3670 1.2799 1.3393 1.3433 1.3931 6.3071 1.7310 1.2327 1.2329 1.2465 1.0960 1.9482 1.0984 1.1012 1.0433 1.0433 1.0509 1.0509 1.0967 2.1104 1.1981 5.8925 6.1381 8.9894 8.6364 1.0361 1.0361 1.0612 1.0627 1.0619 1.0612 1.0595 1.0595 1.1027 1.1013 1.0974 1.0974 1.0996 1.1000 1.1032 1.1032 1.1061 1.1061 1.0845 1.0887 1.0916 1.0942 1.1004
irintensity: 0.0061 0.6319 0.2065 2.1448 0.6908 0.0411 0.2530 1.8772 0.6820 0.1546 1.2588 0.9174 1.5847 2.8461 6.0493 0.4514 1.5398 11.1499 1.4020 16.6259 10.4059 24.6106 1.3109 4.3402 0.3240 0.0020 2.3542 9.1267 8.3608 17.9048 1.3875 12.2708 1.8559 0.8566 3.9034 1.2200 46.8543 0.9579 81.9244 4.1461 16.4492 12.8121 24.0451 1.2816 8.1383 0.1026 9.3993 12.3906 28.1233 3.9558 14.6001 27.7043 0.6284 90.3352 27.0111 31.1207 7.1701 30.6930 23.5278 22.0251 171.9384 46.2732 18.7569 349.0908 146.6150 19.2920 25.3197 0.3165 70.4063 30.8997 104.5379 56.4722 79.8364 152.8928 5.7436 6.1510 16.1508 29.6219 4.3304 59.5617 67.1914 47.6891 60.8911 7.7850 18.2492 22.7071 19.3219 11.6088 1.8847 11.2173 9.8587 19.1120 14.3791 14.4456 13.5396 12.5810 28.4957 110.7500 47.2086 13.0682 104.8585 247.5502 96.5349 38.9095 1.1797 8.6199 7.8685 29.0518 10.8487 8.7212 55.8313 3.7245 12.7047 37.0396 36.6181 11.3578 16.4903 0.6544 0.6134 33.7448 33.1001 6.7895 9.9073 31.9113 33.9163 8.3600
temp: 298.150 k
press: 1.00000 atm
elementType: 8 8 8 8 7 6 6 6 6 6 6 6 6 6 6 6 6 6 6 6 6 1 1 1 1 1 1 1 1 1 1 1 1 1 1 1 1 1 1 1 1 1 1 1
symmnumber: 1
zpe: 960097.1 jmol-1
zpe.correction: 0.365682 hartree
zpe.thermalcorrener: 0.388506 hartree
zpe.thermalcorrenthalpy: 0.389450 hartree
zpe.thermalcorrgfe: 0.308051 hartree
zpe.sumelectzpe: -977.540012 hartree
zpe.sumelectthermal: -977.517188 hartree
zpe.sumelectthermalent: -977.516244 hartree
zpe.sumelectthermalfe: -977.597642 hartree
dipole: 0.0054 -3.2691 -0.0049
dipole: 3.2691
quadrupole: -103.1471 -116.7438 -135.8031
quadrupole: 0.0413 -8.4878 0.0303
quadrupole: 15.4175 1.8209 -17.2384 0.0413 -8.4878 0.0303
hfenergy: -977.9056935 hartree
pointgroup: C01 [X(C16H23N1O4)]
dipole: -0.0105562 -1.2855992 -0.036303 debye
polarizability: 238.5383345|-0.5228568|233.5689795|11.4501753|2.8925595|135.8759011 unknown
InChI: InChI=1S/C16H23NO4/c1-3-20-15(18)10-12-17(13-11-16(19)21-4-2)14-8-6-5-7-9-14/h5-9H,3-4,10-13H2,1-2H3
charge 0 multiplicity 1
44 atoms
O  4.130673 -2.081269 -0.774177
O  -4.151721 -2.073704 0.666534
O  4.009491 -0.848704 1.206722
O  -4.010645 -0.735395 -1.243099
N  0.004856 0.346944 0.014342
C  1.148022 -0.431324 0.506494
C  -1.146852 -0.388111 -0.522475
C  0.012174 1.756508 0.05751
C  2.30101 -0.533521 -0.538615
C  -2.298938 -0.543065 0.51706
C  1.132901 2.47707 0.581005
C  -1.100883 2.519194 -0.42075
C  3.548672 -1.137435 0.074961
C  -3.554756 -1.093508 -0.129283
C  1.129947 3.885899 0.622221
C  -1.08329 3.927808 -0.376311
C  0.027156 4.630354 0.144865
C  5.399971 -2.718768 -0.295615
C  -5.431004 -2.663246 0.154356
C  6.610092 -1.854744 -0.660122
C  -6.626784 -1.798446 0.561745
H  1.551068 0.000122 1.440301
H  0.797464 -1.448188 0.759635
H  -1.546954 0.103916 -1.427084
H  -0.806848 -1.39093 -0.838201
H  2.549817 0.489344 -0.881233
H  1.992856 -1.114342 -1.4230
H  -2.535456 0.458916 0.92419
H  -1.995583 -1.181362 1.362727
H  2.01007 1.946718 0.963315
H  -1.983497 2.02188 -0.833653
H  2.004969 4.404198 1.031776
H  -1.952786 4.479117 -0.753255
H  0.032904 5.724547 0.177972
H  5.326315 -2.867703 0.796053
H  5.411079 -3.69013 -0.815139
H  -5.357789 -2.756684 -0.943484
H  -5.459854 -3.659861 0.622863
H  7.541457 -2.378715 -0.375621
H  6.580104 -0.892183 -0.12256
H  6.642207 -1.658781 -1.745721
H  -7.566531 -2.292267 0.251972
H  -6.580696 -0.810999 0.072696
H  -6.656112 -1.656351 1.655783
