program: Gaussian 09
title: 000264824
version: EM64L-G09RevD.01
frameworkgroup: C1[X(C12H15BrO)]
method: RPBEPBE
basis: SDD
operation: Freq
keyword: #p
keyword: freq=noraman
keyword: PBEPBE/SDD
title: #p freq=noraman PBEPBE/SDD
converged: YES YES NO NO
title: Mulliken charges:
elementType: Br O C C C C C C C C C C C C H H H H H H H H H H H H H H H
charge: 0.005687 -0.180183 0.087202 0.140514 0.180804 0.389880 0.400874 -0.694470 -0.835917 -0.802882 0.065887 -0.830673 -0.821378 -0.776068 0.237232 0.239492 0.241215 0.234890 0.264781 0.230200 0.221795 0.226468 0.235641 0.229591 0.229266 0.228298 0.231461 0.311511 0.308882
chargesum: 0.00000
title: Mulliken charges with hydrogens summed into heavy atoms:
elementType: Br O C C C C C C C C C C C C
charge: 0.005687 -0.180183 0.087202 0.140514 0.180804 0.389880 0.400874 -0.457238 -0.120319 -0.086106 0.065887 -0.138973 -0.132353 -0.155675
polarizability: 1.63897718e+02 -6.16290048e+00 1.66329111e+02 -1.41919249e+01 -3.87215735e+00 1.13273160e+02
1716.lowfreq: -31.5082 -11.0714 -0.0005 -0.0003 -0.0002 4.8185 9.9303 28.5711 48.9971
frequency: -29.9403 28.4318 48.9643 79.2108 107.5949 120.8166 139.7094 149.8929 162.9140 174.0420 195.6511 258.6069 274.2725 311.3918 332.5514 346.9585 353.7166 391.7757 433.8636 480.4984 494.7749 530.0916 557.6049 588.3573 620.7401 668.1907 714.0559 780.2667 832.5569 846.9241 887.4970 896.6884 987.1318 996.3531 1013.4362 1020.2323 1025.6073 1036.1806 1050.3765 1052.9580 1075.0317 1091.0063 1167.4813 1209.7289 1241.2724 1246.5689 1314.9313 1354.0887 1389.8759 1394.6444 1396.3292 1406.6170 1408.6747 1421.9916 1447.4884 1458.4292 1459.9906 1469.7375 1473.2959 1475.7089 1480.2759 1483.4480 1494.0702 1577.0069 1585.4423 1609.3243 2966.5339 2968.6828 2970.5641 2977.8758 3041.2095 3041.8089 3045.6180 3047.9046 3069.0022 3081.9450 3084.2491 3084.9201 3114.2875 3126.8080 3169.7902
redmass: 1.2694 5.4904 3.4479 3.1547 3.0001 5.9336 1.2732 1.1064 1.8739 2.1135 1.5463 3.2921 3.1469 2.9259 2.5957 3.0201 2.6442 4.3014 4.8073 5.2959 4.2804 3.8007 3.1888 3.2559 4.1495 3.8539 4.1887 4.4834 3.4881 3.5623 1.3158 1.8617 1.7156 1.3915 1.5020 1.4191 1.4930 2.2032 1.6096 1.6883 1.6431 2.0322 2.3145 1.1689 4.7031 1.4871 7.3634 6.1882 2.9596 1.2448 1.3403 1.2121 1.2015 1.1294 1.9793 1.1169 1.0724 1.2735 1.0916 1.0749 1.2005 1.1401 1.0675 6.0631 9.6101 6.4117 1.0408 1.0393 1.0378 1.0414 1.0959 1.0967 1.0968 1.0935 1.0555 1.0980 1.0983 1.0974 1.0913 1.0943 1.1126
irintensity: 0.5938 0.5419 1.3376 3.6958 0.1784 2.5758 2.9462 0.6009 0.9070 0.6744 1.5814 4.5055 0.3522 0.4123 1.0255 0.3433 1.5025 5.1697 0.4665 6.9521 12.2271 2.4762 13.2100 3.4497 13.1252 2.5857 1.2149 1.6881 0.5752 0.3115 8.5945 1.0660 11.8107 7.3610 22.3936 2.1546 14.9920 0.7586 1.6483 4.1753 6.0612 2.8411 34.7424 8.2215 26.5297 3.6218 47.8646 1.0181 32.4084 2.8717 4.0170 19.6120 21.3304 29.6051 10.4853 0.1300 5.6968 8.7884 21.9844 9.2632 34.7126 26.3032 12.3433 16.4408 139.2311 6.3985 50.1479 27.2484 29.9366 21.4837 19.7634 48.7737 0.1874 5.4811 7.6220 33.3262 23.6072 5.0545 25.1347 9.3996 1.8119
temp: 298.150 k
press: 1.00000 atm
elementType: 35 8 6 6 6 6 6 6 6 6 6 6 6 6 1 1 1 1 1 1 1 1 1 1 1 1 1 1 1
symmnumber: 1
zpe: 615565.7 jmol-1
zpe.correction: 0.234457 hartree
zpe.thermalcorrener: 0.249572 hartree
zpe.thermalcorrenthalpy: 0.250516 hartree
zpe.thermalcorrgfe: 0.191032 hartree
zpe.sumelectzpe: -553.916962 hartree
zpe.sumelectthermal: -553.901847 hartree
zpe.sumelectthermalent: -553.900903 hartree
zpe.sumelectthermalfe: -553.960387 hartree
dipole: 2.6656 -1.4668 -1.7371
dipole: 3.5035
quadrupole: -91.6738 -80.6193 -103.0940
quadrupole: 1.8446 -0.9829 -1.2153
quadrupole: 0.1219 11.1764 -11.2983 1.8446 -0.9829 -1.2153
hfenergy: -554.1514188 hartree
pointgroup: C01 [X(C12H15Br1O1)]
dipole: -1.1638853 -0.6297452 0.3856223 debye
polarizability: 166.9159962|4.9108427|167.3833033|1.6712625|2.3114607|109.2006893 unknown
InChI: InChI=1S/C12H15BrO/c1-7-5-8(2)10(4)12(9(7)3)11(14)6-13/h5H,6H2,1-4H3
charge 0 multiplicity 1
29 atoms
Br 2.94165 0.512082 2.194487
O  2.445805 0.060111 -1.388299
C  0.32888 -0.066659 -0.180793
C  -0.529812 -1.190365 0.024548
C  -0.175392 1.270354 -0.216792
C  -1.916858 -0.966229 0.248642
C  -1.566334 1.47751 0.021664
C  -2.400916 0.362342 0.255994
C  -0.016175 -2.622617 -0.057063
C  0.713256 2.477775 -0.462775
C  1.809073 -0.294793 -0.357193
C  -2.878378 -2.122959 0.459871
C  -2.155129 2.876726 0.027672
C  2.580299 -0.932852 0.805648
H  -3.469742 0.532898 0.436746
H  -0.695037 -3.242781 -0.670121
H  0.98074 -2.692674 -0.523214
H  0.032055 -3.10369 0.940467
H  1.773617 2.21657 -0.582013
H  0.401954 3.007407 -1.383704
H  0.629068 3.203631 0.368246
H  -2.550989 -2.788864 1.280454
H  -3.888264 -1.755098 0.707963
H  -2.967406 -2.753286 -0.446763
H  -1.698989 3.508962 0.813681
H  -1.983804 3.396979 -0.934098
H  -3.243096 2.848328 0.207308
H  2.018248 -1.700346 1.35331
H  3.572276 -1.277562 0.480331
