program: Gaussian 09
title: 000024429
version: EM64L-G09RevD.01
frameworkgroup: C1[X(C12H14Cl2N2O2)]
method: RPBEPBE
basis: SDD
operation: Freq
keyword: #p
keyword: freq=noraman
keyword: PBEPBE/SDD
title: #p freq=noraman PBEPBE/SDD
converged: YES YES NO NO
title: Mulliken charges:
elementType: Cl Cl O O N N C C C C C C C C C C C C H H H H H H H H H H H H H H
charge: -0.060137 -0.057380 -0.234381 -0.201238 -0.103852 -0.253952 -0.422258 -0.329859 -0.330759 0.316640 0.177650 0.177253 -0.574495 -0.570854 -0.300881 -0.328248 -0.221322 -0.210978 0.266519 0.244578 0.263074 0.238112 0.245609 0.238320 0.277959 0.259918 0.270680 0.253625 0.242097 0.260169 0.231384 0.237007
chargesum: 0.00000
title: Mulliken charges with hydrogens summed into heavy atoms:
elementType: Cl Cl O O N N C C C C C C C C C C C C
charge: -0.060137 -0.057380 -0.234381 -0.201238 -0.103852 -0.253952 0.088839 0.171328 0.153169 0.316640 0.177650 0.177253 -0.036619 -0.046549 -0.058783 -0.068079 0.010062 0.026029
polarizability: 1.87018868e+02 1.10052484e+01 1.65153075e+02 -1.62913648e+01 3.04762244e+01 1.46377074e+02
1716.lowfreq: -7.7492 -3.2600 -0.0017 0.0010 0.0014 6.7487 12.8732 17.9996 23.1716
frequency: 12.2335 17.8204 23.1281 38.5241 67.9233 76.7958 85.8182 115.9135 125.4955 167.9368 196.4922 215.5282 238.0431 262.0932 303.4691 327.8356 351.8257 363.1644 424.8544 428.2204 474.2606 488.5176 564.6774 594.0951 613.6415 664.2799 672.8501 677.0852 682.0196 726.9567 738.5548 749.6082 772.5139 777.0248 826.6084 832.5402 847.6399 883.3661 924.2445 972.6037 978.8671 996.4530 1001.0418 1011.4074 1049.1969 1058.4867 1065.3027 1082.8040 1096.2350 1125.3927 1148.9213 1166.9527 1206.2470 1228.8176 1234.0499 1252.7180 1255.8082 1283.8526 1292.2711 1308.7276 1325.0158 1337.3766 1367.4944 1375.7575 1404.5968 1421.5277 1452.0454 1453.9197 1457.9040 1468.5231 1476.7555 1478.1680 1482.7120 1617.7025 1627.6533 1730.6482 2945.5322 2956.8629 2962.5955 3035.9584 3051.1979 3054.9914 3060.4537 3067.7844 3140.9265 3144.6869 3145.4841 3163.0073 3182.0426 3187.8746
redmass: 8.3099 6.4846 7.3803 7.2527 3.1016 2.5136 4.0838 4.9445 7.3741 4.4747 4.8648 4.9709 4.0622 4.6933 4.7665 4.7671 4.4802 4.2247 3.1952 3.8830 3.4222 7.1550 4.0572 7.1462 6.7762 7.8602 7.4379 6.1346 8.1188 4.8851 4.1962 1.3309 1.1369 1.1488 5.0461 7.4243 1.3912 4.5332 1.3788 1.3035 3.3658 1.7820 1.4861 2.0273 2.9425 3.7021 3.6211 2.2319 1.8484 1.5085 1.5107 1.1445 2.3220 2.2062 1.8312 1.2065 1.2992 1.2652 1.2676 1.6553 1.7103 1.9409 1.3168 1.3450 1.6990 2.4304 1.1133 1.1301 2.4001 1.7774 1.1469 1.1519 1.3413 7.7044 8.1204 12.0073 1.0654 1.0679 1.0677 1.0962 1.0617 1.0612 1.0893 1.0924 1.1118 1.0867 1.1113 1.0920 1.0949 1.0985
irintensity: 1.8567 1.0286 0.3672 1.6385 0.2555 3.0712 2.1194 3.2075 0.1815 0.9350 6.5975 3.1584 3.4393 0.6827 1.0227 2.6963 2.3488 11.3454 7.4979 3.3946 10.4871 2.8903 2.1931 5.5106 2.3707 36.5817 43.7071 93.1954 10.7080 4.0733 25.0573 104.8377 2.6436 14.4211 16.3768 24.7334 0.4573 65.8745 3.0462 0.3019 85.7043 14.0276 5.8316 13.6756 2.5802 5.6008 18.0679 34.5897 41.6397 6.1578 23.7367 6.4247 21.9608 117.0458 33.6244 6.9414 16.5889 4.7903 11.3178 115.2704 27.5836 29.9883 2.7713 1.1467 11.5408 2.4960 1.7648 1.5346 25.0984 44.1951 48.6934 40.4449 28.2957 28.1085 13.5771 586.2790 25.3670 33.7925 51.5586 13.5879 24.7755 14.5301 15.2305 11.8953 16.7498 1.6277 18.9652 14.5753 9.0660 3.8934
temp: 298.150 k
press: 1.00000 atm
elementType: 17 17 8 8 7 7 6 6 6 6 6 6 6 6 6 6 6 6 1 1 1 1 1 1 1 1 1 1 1 1 1 1
symmnumber: 1
zpe: 644469.9 jmol-1
zpe.correction: 0.245466 hartree
zpe.thermalcorrener: 0.263213 hartree
zpe.thermalcorrenthalpy: 0.264157 hartree
zpe.thermalcorrgfe: 0.194705 hartree
zpe.sumelectzpe: -1644.404631 hartree
zpe.sumelectthermal: -1644.386883 hartree
zpe.sumelectthermalent: -1644.385939 hartree
zpe.sumelectthermalfe: -1644.455391 hartree
dipole: -0.4819 -4.0347 -1.5176
dipole: 4.3375
quadrupole: -129.2504 -133.5966 -123.9457
quadrupole: -12.0844 -13.4300 1.8753
quadrupole: -0.3195 -4.6657 4.9852 -12.0844 -13.4300 1.8753
hfenergy: -1644.6500962 hartree
pointgroup: C01 [X(C12H14Cl2N2O2)]
dipole: 0.3530725 -1.643093 -0.296185 debye
polarizability: 184.1099682|8.8940572|180.731387|-21.9147306|19.387093|133.707662 unknown
InChI: InChI=1S/C12H14Cl2N2O2/c13-5-7-15(8-6-14)9-16-10-3-1-2-4-11(10)18-12(16)17/h1-4H,5-9H2
charge 0 multiplicity 1
32 atoms
Cl -2.539846 2.833018 -2.501175
Cl -4.059792 -3.549357 0.115102
O  2.392889 1.622126 0.917143
O  0.609698 2.430642 2.259594
N  -1.825998 -0.056351 0.382911
N  0.488744 0.35841 1.061273
C  -0.853692 -0.053144 1.488063
C  -2.144241 1.265355 -0.207045
C  -2.953106 -1.003437 0.536026
C  1.37422 -0.333079 0.200504
C  2.548575 0.456892 0.12377
C  1.077096 1.559677 1.510164
C  -2.07198 1.167918 -1.737528
C  -2.609381 -2.355178 -0.108799
C  1.279725 -1.547028 -0.500879
C  3.663489 0.091903 -0.632557
C  2.404152 -1.936097 -1.272672
C  3.571984 -1.135371 -1.339623
H  -1.127872 0.647915 2.30659
H  -0.803866 -1.075266 1.906328
H  -1.409922 2.011257 0.14387
H  -3.147058 1.629175 0.101415
H  -3.84516 -0.585701 0.037009
H  -3.231014 -1.160455 1.600151
H  -1.053736 0.9414 -2.084401
H  -2.792675 0.444635 -2.149224
H  -2.449292 -2.26455 -1.192998
H  -1.750478 -2.848663 0.371628
H  0.377851 -2.1624 -0.466559
H  4.555935 0.721478 -0.67237
H  2.36558 -2.876101 -1.832874
H  4.419875 -1.465924 -1.947639
