program: Gaussian 09
title: 000264817
version: EM64L-G09RevD.01
frameworkgroup: C1[X(C11H12N2O2)]
method: RPBEPBE
basis: SDD
operation: Freq
keyword: #p
keyword: freq=noraman
keyword: PBEPBE/SDD
title: #p freq=noraman PBEPBE/SDD
converged: YES YES NO NO
title: Mulliken charges:
elementType: O O N N C C C C C C C C C C C H H H H H H H H H H H H
charge: -0.235149 -0.206618 -0.112847 0.156591 -0.280052 0.367152 -0.371357 0.357556 -0.168905 -0.407650 -0.405186 -0.621504 -0.421465 -0.256613 -0.229542 0.248537 0.243393 0.259719 0.232181 0.233992 0.223468 0.256975 0.230044 0.220807 0.232695 0.227011 0.226768
chargesum: 0.00000
title: Mulliken charges with hydrogens summed into heavy atoms:
elementType: O O N N C C C C C C C C C C C
charge: -0.235149 -0.206618 -0.112847 0.156591 -0.031516 0.367152 0.131755 0.357556 0.063275 -0.173657 -0.181718 0.086321 -0.188770 -0.029602 -0.002774
polarizability: 1.98214749e+02 -1.45587452e+01 1.24519155e+02 4.79116418e+00 1.38899460e+01 1.21425651e+02
1716.lowfreq: -8.0780 -1.4789 -0.0014 -0.0013 -0.0010 13.8944 46.2318 55.9168 75.2791
frequency: 46.2139 55.9061 75.2631 109.2146 138.5326 142.7912 190.5603 212.3717 272.9074 280.5017 382.4468 397.8991 418.7232 453.3873 488.5562 504.7713 524.2746 563.0884 587.5866 611.1593 698.9622 715.4635 730.4416 733.6394 777.9990 790.5362 817.2509 828.6736 869.9970 896.6044 918.3199 942.8401 950.7760 982.6114 992.1285 1033.4456 1052.4102 1110.5429 1117.8190 1153.9140 1162.6133 1170.9283 1181.0693 1193.2097 1213.0721 1233.3042 1265.7157 1273.0385 1323.3016 1329.2965 1362.4238 1384.3949 1406.4710 1416.5476 1434.1092 1439.2396 1461.2918 1467.2574 1491.2800 1505.6784 1570.7405 1614.0293 1634.5658 2940.5222 2958.4669 3039.6183 3053.0975 3092.9027 3101.7793 3124.7605 3136.2191 3142.0972 3156.7926 3162.8740 3184.1604
redmass: 6.3379 6.7872 9.9478 3.9669 1.5872 2.8756 2.4364 3.9260 4.0482 3.3132 4.2900 3.9702 3.3559 2.7916 3.7873 3.7875 5.3224 4.3699 4.5684 6.2704 5.3442 3.4291 3.6012 1.3298 1.5259 4.2262 3.6225 4.1617 1.6627 4.3060 1.3413 1.5583 3.4454 1.3417 2.0927 2.2547 1.8586 1.6257 1.4981 1.4361 1.4946 1.1958 1.4693 2.3801 1.6371 1.9839 1.9569 1.8933 2.0350 1.2866 1.5547 6.9058 3.4258 1.8916 1.2223 1.4002 1.5239 1.1880 1.8453 1.4782 6.1886 6.5073 6.1694 1.0842 1.0372 1.0994 1.0569 1.0986 1.0889 1.0869 1.1088 1.0931 1.0875 1.1002 1.0990
irintensity: 1.6634 1.4207 1.1238 5.1825 0.3020 2.2532 0.3585 5.4964 0.7456 0.5004 1.6150 2.8566 12.3572 0.1104 2.9663 0.7005 0.6110 8.0199 5.6442 11.2577 15.6177 29.7435 25.8147 7.1219 78.0415 9.6302 6.2822 4.8063 4.1014 80.0363 5.8604 2.1724 22.1355 0.3444 0.7316 7.9069 59.1732 40.4511 6.0703 58.6569 35.5452 26.9350 49.5066 102.9024 8.4360 5.5037 28.3961 10.9069 23.1618 3.5546 40.6807 1.6522 74.5142 41.2146 16.7844 8.4209 32.6399 19.0134 11.6102 34.8867 25.3026 37.9654 123.0902 31.0598 88.1269 25.1238 11.2182 15.2918 13.3741 3.7161 3.4555 26.4472 0.9849 31.8289 13.5366
temp: 298.150 k
press: 1.00000 atm
elementType: 8 8 7 7 6 6 6 6 6 6 6 6 6 6 6 1 1 1 1 1 1 1 1 1 1 1 1
symmnumber: 1
zpe: 557444.2 jmol-1
zpe.correction: 0.212319 hartree
zpe.thermalcorrener: 0.225425 hartree
zpe.thermalcorrenthalpy: 0.226370 hartree
zpe.thermalcorrgfe: 0.172174 hartree
zpe.sumelectzpe: -685.132168 hartree
zpe.sumelectthermal: -685.119062 hartree
zpe.sumelectthermalent: -685.118117 hartree
zpe.sumelectthermalfe: -685.172313 hartree
dipole: 0.4944 -2.0425 4.2935
dipole: 4.7803
quadrupole: -81.8817 -89.4199 -84.7041
quadrupole: -6.9234 9.4183 11.0190
quadrupole: 3.4535 -4.0847 0.6312 -6.9234 9.4183 11.0190
hfenergy: -685.344487 hartree
pointgroup: C01 [X(C11H12N2O2)]
dipole: -0.2364509 0.7033668 1.7281171 debye
polarizability: 199.34636|-11.1246656|124.9301495|-4.4186216|-13.9455783|119.8830444 unknown
InChI: InChI=1S/C11H12N2O2/c1-12-7-6-9-4-2-3-5-10(9)11(12)8-13(14)15/h2-7,11H,8H2,1H3
charge 0 multiplicity 1
27 atoms
O  -2.735078 -1.168345 -1.144496
O  -0.723641 -2.25226 -1.372015
N  -1.557861 1.101378 0.583644
N  -1.6267 -1.652274 -0.672953
C  -0.735458 -0.000638 1.096381
C  0.718455 0.091801 0.642241
C  -1.371951 -1.436413 0.785362
C  1.063241 0.845559 -0.523141
C  -1.205695 1.759339 -0.593379
C  0.03488 1.64252 -1.175116
C  1.717689 -0.60921 1.351717
C  -2.894706 1.278765 1.169203
C  2.417198 0.834076 -0.96522
C  3.058216 -0.605582 0.907926
C  3.401719 0.112952 -0.264226
H  -0.773323 0.027909 2.207193
H  -2.34384 -1.528993 1.295093
H  -0.667691 -2.210652 1.123778
H  -1.984405 2.399312 -1.01781
H  0.25686 2.190756 -2.093251
H  1.450787 -1.170233 2.257668
H  -3.608178 0.511841 0.806965
H  -3.286687 2.274058 0.902288
H  -2.833058 1.22322 2.272428
H  2.686856 1.405135 -1.861523
H  3.824233 -1.156877 1.463231
H  4.437739 0.113156 -0.621086
