program: Gaussian 09
title: 000264812
version: EM64L-G09RevD.01
frameworkgroup: C1[X(C10H18O2)]
method: RPBEPBE
basis: SDD
operation: Freq
keyword: #pfreq=noraman
keyword: PBEPBE/SDD
title: #p freq=noraman PBEPBE/SDD
converged: YES YES NO NO
title: Mulliken charges:
elementType: O O C C C C C C C C C C H H H H H H H H H H H H H H H H H H
charge: -0.451433 -0.220804 -0.040078 -0.455704 -0.411329 -0.390014 -0.400505 -0.395413 -0.375926 -0.487573 -0.506784 0.204195 0.178171 0.236262 0.229671 0.210951 0.209759 0.174611 0.211598 0.228379 0.197635 0.199626 0.210467 0.216469 0.196153 0.213233 0.237344 0.234449 0.220104 0.326486
chargesum: 0.00000
title: Mulliken charges with hydrogens summed into heavy atoms:
elementType: O O C C C C C C C C C C
charge: -0.124947 -0.220804 0.138093 0.010229 0.009381 -0.003805 0.025509 0.014681 0.036696 -0.036997 -0.052230 0.204195
polarizability: 1.11508683e+02 8.94733973e-01 1.19605279e+02 1.99228857e-01 -1.85232476e+00 9.49694680e+01
1716.lowfreq: -15.2193 -1.9278 0.0003 0.0004 0.0006 9.7628 78.0390 106.2333 110.5309
frequency: 77.4703 106.1135 110.4988 164.2839 169.9657 181.6989 251.7568 264.9025 291.3522 300.6160 310.1415 336.0997 384.7074 429.1899 450.0664 476.2131 499.7965 528.6731 555.3796 723.0165 726.0855 750.6573 781.8232 802.7525 829.4349 891.0082 894.8127 916.5949 945.2139 967.3946 987.0721 999.1348 1058.8909 1067.1503 1085.1124 1096.8661 1117.5944 1121.3011 1141.5735 1175.8217 1188.8345 1195.6932 1210.1694 1237.0362 1256.6403 1269.4622 1279.5397 1308.0472 1316.9363 1325.7239 1337.8998 1341.8225 1352.5755 1354.8865 1359.4311 1364.5865 1391.1462 1432.0692 1445.1794 1456.7762 1462.2314 1464.5268 1469.9484 1476.2891 1483.9075 1611.3837 2949.9866 2954.9517 2960.3261 2967.6004 2976.3990 2982.8877 2984.7212 2991.7280 2996.5393 3011.7948 3030.0294 3031.4229 3038.0491 3048.9693 3051.7115 3062.1884 3064.5045 3550.3082
redmass: 4.0079 4.2482 3.5755 3.2560 3.1165 2.9926 2.8824 2.5819 1.1366 2.0960 1.7708 2.4331 2.3695 2.5278 2.6703 2.3766 2.4606 2.0395 3.3037 1.9025 2.2144 1.8704 2.0256 2.5346 1.6301 2.4454 1.8905 2.1082 2.1899 2.2544 1.7292 2.5529 1.7744 2.7199 1.4415 1.8590 1.7610 2.1366 1.3610 1.3347 1.5171 1.5141 1.3012 1.2664 1.2864 1.2272 1.2602 1.3234 1.2788 1.2290 1.4628 1.4273 1.4156 1.4100 1.3673 1.3549 1.6250 1.0868 1.0895 1.0902 1.0804 1.0853 1.0865 1.0820 1.0796 8.2087 1.0638 1.0646 1.0668 1.0808 1.0621 1.0629 1.0643 1.0646 1.0671 1.0934 1.0997 1.0976 1.0979 1.0973 1.0963 1.0957 1.0928 1.0660
irintensity: 3.6796 3.4931 1.6423 1.1568 1.1327 1.4715 4.5489 5.7520 110.7918 10.1189 2.3067 4.7931 7.1942 1.4951 2.0575 6.1107 0.6319 0.7341 7.5082 5.6560 1.7909 9.3230 19.1685 2.1256 3.6993 28.3898 1.9701 4.1429 26.3606 1.8036 5.2961 38.3583 15.7752 8.6767 13.6642 6.0440 16.0593 2.9152 14.4348 11.3047 6.1476 9.1774 19.0954 10.6383 16.2618 19.0454 1.1848 4.8192 2.5127 5.9690 14.3575 2.9155 2.8626 8.5697 8.5506 0.4146 10.8243 16.7734 12.6981 15.5613 5.4646 11.6996 9.8925 23.7714 26.4012 89.9091 46.2101 12.0630 29.6097 24.1140 19.9402 28.3018 59.7772 42.6546 14.0659 35.7917 47.2851 16.8134 10.5088 66.9663 23.4216 31.9484 62.5450 3.1283
temp: 298.150 k
press: 1.00000 atm
elementType: 8 8 6 6 6 6 6 6 6 6 6 6 1 1 1 1 1 1 1 1 1 1 1 1 1 1 1 1 1 1
symmnumber: 1
zpe: 693924.4 jmol-1
zpe.correction: 0.264302 hartree
zpe.thermalcorrener: 0.276779 hartree
zpe.thermalcorrenthalpy: 0.277723 hartree
zpe.thermalcorrgfe: 0.226753 hartree
zpe.sumelectzpe: -541.316040 hartree
zpe.sumelectthermal: -541.303563 hartree
zpe.sumelectthermalent: -541.302619 hartree
zpe.sumelectthermalfe: -541.353589 hartree
dipole: -0.4621 2.2176 -2.3607
dipole: 3.2717
quadrupole: -86.3627 -67.7509 -75.6717
quadrupole: 0.8137 7.2157 0.6958
quadrupole: -9.7676 8.8442 0.9234 0.8137 7.2157 0.6958
hfenergy: -541.5803417 hartree
pointgroup: C01 [X(C10H18O2)]
dipole: -0.1669615 -0.8676831 0.9360235 debye
polarizability: 111.5506544|-1.0573166|119.5287768|-0.0889102|-2.0812617|95.0039992 unknown
InChI: InChI=1S/C10H18O2/c11-9-5-1-2-6-10(12)8-4-3-7-9/h9,11H,1-8H2
charge 0 multiplicity 1
30 atoms
O  3.167589 -0.300539 0.423076
O  -2.331522 0.438656 -1.141015
C  1.732165 0.026558 0.214716
C  1.112444 -0.890528 -0.866881
C  1.725124 1.527802 -0.138342
C  0.609331 -2.262433 -0.348815
C  0.364583 2.160381 -0.53045
C  -0.545056 -2.205189 0.6865
C  -0.752876 2.242374 0.543992
C  -1.863703 -1.54489 0.189105
C  -1.360292 0.901771 1.043466
C  -1.860893 -0.029812 -0.066511
H  1.210386 -0.12575 1.181572
H  1.883296 -1.046517 -1.647609
H  0.274039 -0.376834 -1.368672
H  2.427426 1.661297 -0.98564
H  2.165583 2.075705 0.718062
H  1.451065 -2.828733 0.106399
H  0.277024 -2.864505 -1.218356
H  -0.04608 1.666962 -1.431077
H  0.579115 3.20201 -0.843364
H  -0.203996 -1.707673 1.615016
H  -0.790863 -3.244263 0.981817
H  -1.573857 2.846889 0.114623
H  -0.376089 2.793607 1.429344
H  -2.639957 -1.728246 0.964124
H  -2.213945 -2.032322 -0.739713
H  -2.248556 1.136573 1.670592
H  -0.664975 0.364041 1.709532
H  3.244493 -1.268794 0.62141
