program: Gaussian 09
title: 000264816
version: EM64L-G09RevD.01
frameworkgroup: C1[X(C11H10N2O4)]
method: RPBEPBE
basis: SDD
operation: Freq
keyword: #p
keyword: freq=noraman
keyword: PBEPBE/SDD
title: #p freq=noraman PBEPBE/SDD
converged: YES YES NO NO
title: Mulliken charges:
elementType: O O O O N N C C C C C C C C C C C H H H H H H H H H H
charge: -0.348251 -0.258296 -0.423533 -0.236095 -0.467640 -0.625422 0.359035 0.097673 -0.337451 -0.301755 -0.218673 -0.275895 0.212529 0.177290 -0.246227 -0.250926 0.162310 0.318325 0.195771 0.386425 0.236740 0.234889 0.278255 0.327367 0.345792 0.275969 0.381794
chargesum: 0.00000
title: Mulliken charges with hydrogens summed into heavy atoms:
elementType: O O O O N N C C C C C C C C C C C
charge: -0.348251 -0.258296 -0.041739 -0.236095 -0.081215 0.047737 0.359035 0.097673 -0.019126 -0.105984 0.018067 -0.041005 0.212529 0.177290 0.032027 0.025043 0.162310
polarizability: 2.52527907e+02 -6.37042631e+00 1.81392075e+02 5.56436886e-01 -8.94343967e-02 5.84053540e+01
1716.lowfreq: -5.4709 -3.4753 -0.0008 -0.0006 0.0004 2.2434 12.6373 33.3417 42.4847
frequency: 12.4340 33.2570 42.4758 59.8766 99.3410 131.7446 141.1116 160.0778 174.3386 197.5647 260.3165 281.7272 319.5424 377.1952 396.7164 407.2338 460.1791 484.0117 502.7069 528.0060 555.3384 562.9268 587.5161 589.1299 606.2660 646.5830 676.2456 694.4161 731.4289 752.7980 761.0744 784.9227 844.9040 883.2430 897.0933 924.8947 950.0079 954.2753 961.4645 1010.3612 1015.2322 1040.0076 1047.2322 1059.1635 1100.2563 1149.3589 1183.0188 1231.1124 1246.6102 1261.7081 1269.8073 1315.8551 1341.2382 1350.5396 1402.0782 1435.1254 1455.5872 1508.4222 1555.4608 1570.8953 1608.5217 1617.8944 1635.8642 1645.2348 1663.3007 3101.3971 3127.9105 3143.2425 3146.6495 3153.0291 3167.2988 3190.0190 3522.4273 3537.8477 3690.1788
redmass: 6.5006 5.1219 7.9166 7.3685 4.9039 4.1748 3.9849 7.2413 4.1955 8.2428 5.9893 4.6045 5.6576 8.3784 7.1649 2.6683 4.5335 1.4145 4.8798 2.8297 4.2604 1.7330 1.3429 4.4780 4.8672 1.8527 4.9270 3.6477 7.2928 1.9807 4.4990 2.5324 6.2004 1.4219 2.1204 7.2036 1.2450 1.3903 3.2658 1.3173 1.1043 2.1053 2.8547 2.1779 2.3449 1.8235 1.0876 1.8616 2.3206 1.5759 1.4155 2.0875 1.9633 4.2957 6.3884 2.7144 2.7379 3.3435 5.4222 4.6933 2.8128 1.9222 7.0798 3.0736 2.7327 1.0847 1.0865 1.0901 1.0981 1.0868 1.0981 1.0958 1.0641 1.0456 1.1036
irintensity: 1.2180 3.8199 1.7771 0.8209 4.0653 0.2207 5.5846 4.0895 4.3608 3.4348 5.2886 1.0473 3.8324 8.6906 5.0139 0.4716 18.9442 100.0351 9.7363 30.6635 53.2943 38.4163 119.8505 22.5807 16.6085 96.9462 5.2822 71.9884 9.8642 68.0010 11.9809 19.1200 14.6969 4.2233 0.3856 20.3982 41.8927 11.4648 18.9621 4.6717 95.0124 14.3221 1.5971 348.1388 2.0527 4.1750 4.1859 64.1149 29.8557 6.8227 35.6398 26.8878 213.7269 335.8086 125.7185 1.8401 66.2811 415.7607 296.2157 57.7008 287.6240 254.3348 171.9525 72.0532 13.4612 276.3864 16.0079 14.6345 0.8747 5.5764 21.2321 13.5643 48.5744 70.8434 34.7541
temp: 298.150 k
press: 1.00000 atm
elementType: 8 8 8 8 7 7 6 6 6 6 6 6 6 6 6 6 6 1 1 1 1 1 1 1 1 1 1
symmnumber: 1
zpe: 519982.4 jmol-1
zpe.correction: 0.198051 hartree
zpe.thermalcorrener: 0.213686 hartree
zpe.thermalcorrenthalpy: 0.214631 hartree
zpe.thermalcorrgfe: 0.152311 hartree
zpe.sumelectzpe: -834.389085 hartree
zpe.sumelectthermal: -834.373450 hartree
zpe.sumelectthermalent: -834.372505 hartree
zpe.sumelectthermalfe: -834.434825 hartree
dipole: 5.3496 5.2794 0.3648
dipole: 7.5248
quadrupole: -79.6517 -93.2824 -101.6998
quadrupole: -1.8357 1.1818 2.5329
quadrupole: 11.8929 -1.7377 -10.1552 -1.8357 1.1818 2.5329
hfenergy: -834.5871361 hartree
pointgroup: C01 [X(C11H10N2O4)]
dipole: 2.1886313 1.6364367 1.1386588 debye
polarizability: 249.82572|-16.9401712|161.8209204|12.7996662|45.5897997|80.6786956 unknown
InChI: InChI=1S/C11H10N2O4/c12-11(17)7-3-1-2-4-8(7)13-9(14)5-6-10(15)16/h1-6,13,15H,12H2
charge 0 multiplicity 1
27 atoms
O  0.15577 1.840677 0.808154
O  -0.847339 -2.617121 -1.062951
O  -4.647338 1.816688 0.424747
O  -5.332487 -0.183635 -0.551944
N  -0.123673 -0.543341 -0.189509
N  2.173197 2.496812 1.677982
C  1.271288 -0.718186 -0.11296
C  2.065289 0.352077 0.44454
C  1.915265 -1.905349 -0.567726
C  3.478077 0.198786 0.478057
C  3.314067 -2.023913 -0.498561
C  4.107681 -0.969941 0.015258
C  1.409846 1.59083 0.974224
C  -1.089866 -1.442643 -0.632612
C  -2.504026 -0.955135 -0.581823
C  -2.955787 0.237819 -0.098467
C  -4.40682 0.545048 -0.121358
H  1.295582 -2.708248 -0.970728
H  4.113473 1.012673 0.845568
H  -0.408484 0.411306 0.130909
H  3.790294 -2.942514 -0.858173
H  5.198013 -1.058354 0.047679
H  -3.226851 -1.678474 -0.979587
H  3.146115 2.339654 1.925427
H  1.703451 3.335409 2.01771
H  -2.310682 1.016997 0.323046
H  -5.624953 2.002678 0.398797
