program: Gaussian 09
title: 000264818
version: EM64L-G09RevD.01
frameworkgroup: C1[X(C11H12N4O2)]
method: RPBEPBE
basis: SDD
operation: Freq
keyword: #p
keyword: freq=noraman
keyword: PBEPBE/SDD
title: #p freq=noraman PBEPBE/SDD
converged: YES YES NO NO
title: Mulliken charges:
elementType: O O N N N N C C C C C C C C C C C H H H H H H H H H H H H
charge: -0.271042 -0.253544 -0.434845 -0.408868 -0.387714 -0.638531 -0.522311 0.052527 0.454296 0.328360 0.137742 -0.429535 -0.368309 0.146256 -0.221172 -0.228523 -0.237815 0.249972 0.223022 0.285751 0.337888 0.244531 0.224436 0.357515 0.227598 0.223851 0.366154 0.313551 0.228759
chargesum: 0.00000
title: Mulliken charges with hydrogens summed into heavy atoms:
elementType: O O N N N N C C C C C C C C C C C
charge: -0.271042 -0.253544 -0.149094 -0.070980 -0.030199 0.041174 -0.049318 0.052527 0.454296 0.328360 0.137742 -0.185004 -0.143873 0.146256 0.006427 -0.004672 -0.009056
polarizability: 2.18714639e+02 -4.52926059e+00 1.67656534e+02 -1.53630315e+01 2.04064256e+00 7.24606973e+01
1716.lowfreq: -2.3668 -0.0009 -0.0006 0.0002 4.4836 10.9200 22.8888 26.7188 47.4667
frequency: 22.7711 25.7496 47.4628 62.7725 104.1282 144.7045 170.0774 189.0686 235.5997 261.4422 283.8038 318.7119 332.9893 362.5489 387.1028 403.8412 472.4226 496.1072 501.1596 571.9829 589.4293 614.0262 616.6677 622.0594 623.9659 680.0215 691.9653 703.8541 717.8114 737.8342 755.5943 772.7839 789.9978 853.1694 857.9119 920.4709 953.8063 967.0266 975.6331 990.7501 995.6519 1026.0720 1030.1187 1041.6872 1084.6637 1096.9039 1171.6473 1183.4865 1191.1469 1218.0517 1232.5579 1257.0966 1316.2988 1329.4571 1343.0483 1347.7964 1384.6144 1387.1035 1426.1248 1439.3506 1483.4137 1494.9045 1513.0681 1563.7721 1594.9013 1614.8960 1619.9552 1644.1635 1679.1173 2968.8963 3029.6823 3116.3082 3121.5451 3133.4555 3145.0751 3162.6002 3418.5035 3457.7386 3533.9918 3558.5101 3673.2907
redmass: 4.2809 4.8383 6.9665 3.8743 5.8089 6.9857 9.7237 4.4202 3.9708 1.6134 1.8335 3.3595 3.1627 8.6454 5.0572 2.8101 7.2924 3.6229 7.0163 1.1865 5.4953 5.2305 5.6133 3.6312 3.5650 1.3884 2.0280 1.7827 5.6808 1.5913 2.6764 2.2382 3.2501 1.3353 2.7542 1.4485 2.7086 1.9750 1.3964 6.2257 1.3201 2.1865 2.9331 3.1363 1.5400 2.5348 1.0556 1.1376 1.2732 2.6437 3.8944 6.3581 1.3357 1.6414 1.7556 1.6022 4.2724 4.3002 1.1859 2.1272 2.2774 1.1326 2.9116 1.5165 6.0675 6.1784 7.3373 4.8578 5.4943 1.0610 1.1017 1.0859 1.0871 1.0917 1.0962 1.1015 1.0739 1.0513 1.0773 1.0779 1.0978
irintensity: 0.6360 1.5464 0.1342 1.7767 1.3228 1.1422 3.7502 3.0466 4.2097 68.4241 37.8310 9.5466 7.3759 12.8952 0.5633 0.1042 9.9600 16.2176 15.5579 170.8491 0.7610 0.8311 1.9783 6.1028 0.8799 53.7161 27.8457 41.2900 15.1512 159.4952 129.9537 13.1275 9.0743 1.8598 13.2577 5.3716 10.2020 9.4730 0.4585 0.1182 0.3784 11.9450 6.3741 12.3521 9.8685 51.1482 0.0023 9.9039 26.6193 8.2934 84.1051 35.2989 1.4915 3.6154 36.5086 3.1325 46.1909 54.6807 9.4515 6.3430 16.2053 2.7256 50.6534 129.8977 6.6930 4.3021 238.6876 535.4748 772.9955 32.8691 16.3390 9.4889 1.5737 16.0480 42.1309 23.8087 4.1090 105.4674 57.0631 60.6476 87.5693
temp: 298.150 k
press: 1.00000 atm
elementType: 8 8 7 7 7 7 6 6 6 6 6 6 6 6 6 6 6 1 1 1 1 1 1 1 1 1 1 1 1
symmnumber: 1
zpe: 591313.5 jmol-1
zpe.correction: 0.225219 hartree
zpe.thermalcorrener: 0.240394 hartree
zpe.thermalcorrenthalpy: 0.241339 hartree
zpe.thermalcorrgfe: 0.180827 hartree
zpe.sumelectzpe: -794.642675 hartree
zpe.sumelectthermal: -794.627500 hartree
zpe.sumelectthermalent: -794.626556 hartree
zpe.sumelectthermalfe: -794.687067 hartree
dipole: 2.1520 5.5184 -0.3189
dipole: 5.9317
quadrupole: -111.1687 -86.2217 -102.1492
quadrupole: -9.6900 -0.0282 -1.0383
quadrupole: -11.3222 13.6248 -2.3027 -9.6900 -0.0282 -1.0383
hfenergy: -794.8678942 hartree
pointgroup: C01 [X(C11H12N4O2)]
dipole: 0.8313777 1.6583425 1.415961 debye
polarizability: 218.1215541|9.6667333|119.6254298|-15.9486697|47.2881827|121.0848858 unknown
InChI: InChI=1S/C11H12N4O2/c12-9-8(10(16)15-11(17)14-9)13-6-7-4-2-1-3-5-7/h1-5,13-15H,6,12H2
charge 0 multiplicity 1
29 atoms
O  -1.381685 -1.463299 -1.973796
O  -5.392131 -0.283067 0.16696
N  0.122281 0.516093 -0.33503
N  -3.418416 0.818238 0.762418
N  -3.366483 -0.85406 -0.888074
N  -1.435366 1.983383 1.403188
C  0.984437 -0.627429 0.131272
C  -1.295595 0.264529 -0.272961
C  2.456597 -0.260253 0.035854
C  -2.04463 1.025348 0.633924
C  -1.946997 -0.729107 -1.104194
C  3.292924 -0.879104 -0.92616
C  3.015975 0.717803 0.898533
C  -4.150059 -0.133435 0.010434
C  4.661019 -0.531678 -1.024428
C  4.380724 1.066565 0.806002
C  5.208218 0.441457 -0.157884
H  0.778606 -1.541989 -0.461865
H  0.700993 -0.835143 1.180181
H  0.418367 0.811524 -1.277251
H  -3.984184 1.357183 1.420579
H  2.869452 -1.635223 -1.598606
H  2.375122 1.201307 1.646274
H  -3.853454 -1.549919 -1.460565
H  5.296102 -1.019548 -1.772368
H  4.802017 1.818796 1.48281
H  -0.432266 2.084515 1.215186
H  -1.921061 2.579947 2.066009
H  6.268288 0.709869 -0.230139
