program: Gaussian 09
title: 000264811
version: EM64L-G09RevD.01
frameworkgroup: C1[X(C10H13BrN2)]
method: RPBEPBE
basis: SDD
operation: Freq
keyword: #p
keyword: freq=noraman
keyword: PBEPBE/SDD
title: #p freq=noraman PBEPBE/SDD
converged: YES YES NO NO
title: Mulliken charges:
elementType: Br N N C C C C C C C C C C H H H H H H H H H H H H H
charge: -0.033000 -0.164897 -0.573109 -0.095237 -0.429130 -0.554651 0.356099 0.208543 -0.703411 -0.348692 -0.364281 -0.241307 -0.175964 0.217749 0.229516 0.203269 0.232368 0.225275 0.239637 0.204611 0.219993 0.245645 0.279443 0.294795 0.285196 0.241539
chargesum: 0.00000
title: Mulliken charges with hydrogens summed into heavy atoms:
elementType: Br N N C C C C C C C C C C
charge: -0.033000 -0.164897 0.006882 0.122513 0.003656 -0.097009 0.356099 0.208543 -0.039170 -0.103047 -0.084838 -0.241307 0.065575
polarizability: 2.09923347e+02 -3.44991925e+00 1.30725721e+02 1.66232903e+00 8.22050190e-02 7.64599309e+01
1716.lowfreq: -12.9593 -7.1397 -0.0007 -0.0005 -0.0005 4.2738 38.5565 84.5217 128.4001
frequency: 38.1878 84.5214 128.3958 135.9748 159.7246 196.4916 227.9629 255.1384 294.8352 338.0258 346.2917 359.7404 413.6552 421.3569 446.0900 469.4240 525.8928 528.1211 547.9719 568.8333 646.8861 689.7013 716.6317 809.6658 827.0814 827.9896 874.5395 892.7400 924.8142 961.5313 969.9502 996.8466 1041.6638 1070.8249 1091.6897 1111.6095 1142.5867 1177.3082 1185.8723 1210.7130 1215.8882 1230.4550 1258.1114 1291.1386 1309.7680 1336.5831 1351.2130 1373.5847 1375.5575 1380.9136 1408.5371 1456.6371 1463.9042 1470.4435 1476.7094 1483.0162 1570.7934 1598.6518 1658.7458 2966.6432 2975.3775 2979.3826 3002.2261 3033.6718 3060.6059 3067.9313 3088.5382 3141.7399 3158.5129 3181.8319 3409.0054 3545.5845
redmass: 3.3551 4.9206 3.1892 3.9880 4.4398 1.2258 6.6161 2.3747 3.2480 3.6457 1.7525 1.5959 3.2585 2.5358 2.6670 2.3166 3.6088 2.6935 3.4533 4.7001 2.4242 4.5539 3.7620 3.6147 1.7663 1.8998 1.5282 1.8223 1.9658 1.3577 1.9076 2.0435 2.0124 1.9830 1.8261 1.7022 1.8194 1.9084 1.5452 1.9623 1.7893 1.3136 1.4683 1.7159 1.4607 1.5073 1.4114 6.2071 1.9068 1.2598 4.2855 1.1431 1.1090 1.3862 1.4554 1.1455 7.5667 5.7645 1.1520 1.0658 1.0733 1.0442 1.0647 1.0932 1.1033 1.0991 1.1000 1.0919 1.0887 1.0950 1.0420 1.1017
irintensity: 1.5629 0.5680 5.3084 2.8933 2.7979 0.6365 1.6729 1.2687 5.0130 4.8185 7.5328 28.4755 6.4376 5.4506 16.0803 50.3064 9.3269 138.0544 22.3653 9.1614 4.4607 0.7073 1.1380 15.8060 31.3856 29.8385 8.3772 10.1950 13.7107 2.2253 5.7897 5.2783 6.6487 19.3668 1.7902 12.8007 10.9291 15.7558 31.0230 13.7874 10.8467 0.4915 2.1741 51.3898 11.5672 22.2933 3.1416 8.3186 4.0317 21.0552 34.3125 13.5387 18.2380 127.7485 64.9585 52.3347 10.9333 10.1362 30.5169 30.2054 23.7342 35.6385 56.5234 34.3708 31.7524 38.7718 43.0433 6.2425 3.1561 3.6201 10.4513 2.1868
temp: 298.150 k
press: 1.00000 atm
elementType: 35 7 7 6 6 6 6 6 6 6 6 6 6 1 1 1 1 1 1 1 1 1 1 1 1 1
symmnumber: 1
zpe: 556137.8 jmol-1
zpe.correction: 0.211822 hartree
zpe.thermalcorrener: 0.224413 hartree
zpe.thermalcorrenthalpy: 0.225357 hartree
zpe.thermalcorrgfe: 0.172226 hartree
zpe.sumelectzpe: -510.829958 hartree
zpe.sumelectthermal: -510.817366 hartree
zpe.sumelectthermalent: -510.816422 hartree
zpe.sumelectthermalfe: -510.869553 hartree
dipole: -6.1610 -0.1494 0.0966
dipole: 6.1636
quadrupole: -77.3631 -79.5295 -88.9193
quadrupole: -2.4582 0.0814 0.3911
quadrupole: 4.5742 2.4078 -6.9820 -2.4582 0.0814 0.3911
hfenergy: -511.0417794 hartree
pointgroup: C01 [X(C10H13Br1N2)]
dipole: 2.4237852 0.065015 -0.0367981 debye
dipolederiv: -0.7987513 -0.1070972 -0.0325125 -0.1538832 -0.1193511 -0.0065119 -0.0471779 -0.0062065 -0.0679414 -1.2207235 -0.0461928 0.0421018 -0.1492618 -0.0495927 -0.0322667 -0.3220668 -0.1048291 -0.3832777 -0.5001239 0.2682586 0.0201789 0.4459077 -0.2205643 -0.0266582 0.0637618 0.002565 0.0306454 0.5846934 -0.1613547 -0.0923081 -0.4813416 0.1794193 0.0777308 -0.0187734 0.0654124 0.4046348 0.05982 -0.0205313 0.0082918 0.0244158 -0.0188826 0.0072316 0.0583172 0.0127705 0.0755846 -0.0045359 -0.018334 -0.0330148 -0.0107088 0.0664075 0.0015218 -0.0212125 -0.0345195 0.1588246 -0.2344217 -0.0652718 -0.0207206 -0.4674243 0.0921429 -0.0085282 -0.0686063 0.0369531 -0.1085854 1.540749 0.3180473 0.0389466 0.4627547 -0.1499132 -0.0049432 0.1685352 0.0181314 0.0823791 -0.040303 0.0244704 0.0516134 0.1151684 0.0163255 0.0001073 0.1101119 -0.0469569 -0.1668078 -0.129277 -0.0325088 -0.0090012 -0.0963893 0.0323117 0.0075622 0.0127184 0.00294 -0.1018652 -0.376552 -0.1296733 0.0132808 0.1494324 0.0306127 0.0112001 -0.0086275 0.0021578 -0.1997371 1.1020836 0.2203566 0.0669695 0.3239052 -0.0915628 0.0143047 0.0822986 0.0116251 -0.1527657 -0.1996289 0.0072758 -0.0051293 0.0026726 0.1199665 -0.0012832 -0.0028499 0.0008333 -0.1013588 -0.1697119 -0.0405863 -0.077002 -0.0657882 0.0080528 -0.0703271 -0.0917377 -0.0506932 -0.0482066 0.0589009 -0.0329553 0.0502558 -0.0568452 0.0654496 -0.0445757 0.0077805 -0.0011026 -0.1597993 -0.1100388 0.1358294 -0.0109036 0.1467961 -0.0723975 0.0033054 0.0210583 -0.0195659 0.0898634 -0.0055078 -0.086204 0.0474182 -0.030877 -0.0840664 0.0770151 0.0150041 0.1119301 0.0396554 0.0048248 0.0987716 0.0228332 0.076575 0.0160917 -0.0551269 0.0353485 -0.1073087 -0.1169628 -0.0296055 -0.0535946 -0.1147093 -0.0425205 0.0632308 -0.0530144 -0.0808594 -0.026222 0.0188742 0.0605853 -0.0655239 0.0431114 -0.1383121 -0.0993831 0.120294 0.0250152 0.0673319 0.0265072 -0.0738982 0.1175888 0.0240235 0.1753669 -0.0322508 -0.0277277 0.0364207 0.000244 0.0751879 0.0928393 -0.0325448 -0.003105 -0.0538435 -0.0666645 -0.0025957 -0.0059715 0.0016947 0.1445385 0.0976664 -0.0371526 -0.008135 -0.0145337 -0.0168463 -0.0024887 -0.0124407 -0.004859 0.1652676 0.138839 -0.174627 -0.1142339 -0.098535 0.1768597 0.0425164 -0.0638905 0.0153854 0.102559 0.1404276 -0.1793611 0.0969569 -0.1570556 0.1477672 -0.0301024 0.1144313 0.0473381 0.0357182 0.0116502 0.092915 -0.0052062 0.0943253 0.0068376 0.0033603 -0.0065876 0.0049507 0.1570681 unknown
polarizability: 209.363489|7.4698747|131.2838834|1.7297184|-0.0010707|76.4616262 unknown
InChI: InChI=1S/C10H13BrN2/c1-7-2-3-8-6-9(11)4-5-10(8)13(7)12/h4-7H,2-3,12H2,1H3
charge 0 multiplicity 1
26 atoms
Br -4.534573 -0.439061 -0.148098
N  1.537949 0.834553 0.237581
N  1.941033 2.180936 0.116178
C  2.571428 -0.226737 0.102889
C  2.043571 -1.530514 0.747433
C  0.708339 -1.96959 0.109633
C  -0.290972 -0.820126 0.081079
C  0.158144 0.540425 0.125124
C  3.024832 -0.418283 -1.367812
C  -1.677498 -1.085664 0.008147
C  -0.802254 1.589344 0.080937
C  -2.607878 -0.030982 -0.035885
C  -2.180738 1.311207 -0.000216
H  3.445353 0.120442 0.691376
H  1.895357 -1.352533 1.829131
H  2.805796 -2.324124 0.638087
H  0.285189 -2.82377 0.6699
H  0.8908 -2.339025 -0.920332
H  2.184703 -0.741333 -2.007045
H  3.429345 0.522659 -1.786312
H  3.824098 -1.179691 -1.429708
H  -2.021562 -2.125525 -0.015407
H  -0.441237 2.619919 0.112847
H  2.464505 2.527241 0.925614
H  2.344704 2.433737 -0.794244
H  -2.904739 2.130596 -0.0334
