program: Gaussian 09
title: 000264813
version: EM64L-G09RevD.01
frameworkgroup: C1[X(C10H19BrO2)]
method: RPBEPBE
basis: SDD
operation: Freq
keyword: #p
keyword: freq=noraman
keyword: PBEPBE/SDD
title: #p freq=noraman PBEPBE/SDD
converged: YES YES NO NO
title: Mulliken charges:
elementType: Br O O C C C C C C C C C C H H H H H H H H H H H H H H H H H H H
charge: -0.049669 -0.266453 -0.242348 -0.377018 -0.366118 -0.374193 -0.376119 -0.313342 -0.514069 -0.694749 0.239929 -0.262774 -0.664273 0.200529 0.199826 0.191986 0.190823 0.197324 0.197267 0.212581 0.222362 0.227515 0.227301 0.242631 0.246740 0.277843 0.277850 0.222580 0.233091 0.217305 0.249338 0.226304
chargesum: 0.00000
title: Mulliken charges with hydrogens summed into heavy atoms:
elementType: Br O O C C C C C C C C C C
charge: -0.049669 -0.266453 -0.242348 0.023337 0.016691 0.020397 0.058824 0.141474 -0.024699 -0.139055 0.239929 0.192897 0.028674
polarizability: 1.92758781e+02 -1.09882767e+01 1.10995941e+02 -1.42291236e+00 1.35918579e+00 9.30925670e+01
1716.lowfreq: -51.6956 -6.3794 -1.5032 -0.0007 0.0004 0.0005 11.8603 18.4662 28.0522
frequency: -37.6534 13.7827 28.0404 31.0421 59.9650 67.9574 83.4165 97.5251 111.6490 128.4789 132.4650 139.1775 193.2403 232.8501 275.2409 307.5493 345.9567 407.7807 439.5383 490.4201 554.2582 617.6862 657.1868 720.1732 732.1553 754.0926 785.7225 803.9647 817.8044 882.0778 891.0919 970.2913 994.8523 1001.4212 1017.5587 1049.3885 1056.3819 1065.6228 1077.1977 1093.3003 1095.5379 1108.6626 1131.8394 1156.4806 1200.5209 1203.2144 1234.5252 1240.9854 1272.2040 1275.8726 1279.5023 1281.2668 1293.3326 1294.4485 1312.7666 1338.2561 1350.7769 1356.6661 1366.1110 1390.3607 1438.9503 1448.6402 1457.8669 1460.1071 1461.9050 1464.2424 1467.1709 1477.0119 1485.1443 1485.2402 1642.4300 2951.0267 2956.5223 2965.9659 2981.6003 2989.9824 2992.4529 2993.4055 2996.1962 3003.0102 3028.0456 3028.2125 3035.9913 3046.5381 3058.3960 3062.4124 3087.5110 3091.6348 3117.8003 3131.5023
redmass: 2.1002 4.6813 3.5083 3.3867 2.3516 3.7898 2.8733 3.6293 2.3801 2.6290 3.7528 2.8276 2.3241 1.5315 4.0129 2.9354 3.8097 3.4590 3.4189 3.4199 2.8036 4.8526 4.1854 1.0796 1.1045 1.1619 2.0089 1.2880 1.7182 1.3324 3.6681 1.2678 4.5180 4.1008 3.3491 1.0988 3.4987 3.0866 2.2642 3.3287 2.2250 1.5599 2.6152 1.6726 1.5564 1.2263 1.2700 1.3405 1.2457 1.2527 1.1207 1.0506 1.0906 1.1151 1.3791 1.4411 1.4479 1.4449 1.6630 1.2340 1.0867 1.1026 1.0912 1.0731 1.0692 1.0441 1.0841 1.0979 1.0656 1.0850 8.9353 1.0588 1.0584 1.0590 1.0630 1.0963 1.0360 1.0615 1.0594 1.1010 1.0699 1.0900 1.1007 1.0563 1.1040 1.1029 1.0974 1.1033 1.1059 1.1112
irintensity: 0.0121 0.0019 0.5627 0.1224 0.5264 1.1426 0.1144 2.0558 2.9589 0.8179 0.1456 1.1574 2.6373 1.0581 5.5828 18.9503 6.5324 1.7653 0.6843 0.4226 2.3672 42.1311 6.2632 14.5275 1.7830 8.4191 8.5583 0.1965 3.1252 3.0799 14.7979 0.0857 0.9951 12.5809 31.1190 2.5467 68.9779 9.7559 15.3364 31.1196 28.1383 44.0104 193.2847 12.2945 0.6834 23.1773 89.7756 2.6715 2.1367 2.4853 4.0648 0.3461 0.3645 0.1055 64.9830 1.6325 1.9369 0.3900 17.6137 23.1108 25.1671 2.2718 12.0783 0.0831 1.9247 13.8773 1.5723 0.3794 4.6976 34.4204 148.8633 10.4945 4.4234 65.9278 4.9217 5.0572 20.7084 31.9550 30.4309 0.1902 44.4138 6.0045 19.6306 24.6963 11.8620 110.9388 37.5724 0.5794 35.0504 18.9706
temp: 298.150 k
press: 1.00000 atm
elementType: 35 8 8 6 6 6 6 6 6 6 6 6 6 1 1 1 1 1 1 1 1 1 1 1 1 1 1 1 1 1 1 1
symmnumber: 1
zpe: 718468.5 jmol-1
zpe.correction: 0.273650 hartree
zpe.thermalcorrener: 0.289863 hartree
zpe.thermalcorrenthalpy: 0.290808 hartree
zpe.thermalcorrgfe: 0.224990 hartree
zpe.sumelectzpe: -555.314020 hartree
zpe.sumelectthermal: -555.297807 hartree
zpe.sumelectthermalent: -555.296863 hartree
zpe.sumelectthermalfe: -555.362681 hartree
dipole: -3.3234 2.5485 0.3168
dipole: 4.2000
quadrupole: -98.7650 -94.5008 -88.1613
quadrupole: -0.4870 -0.1817 -0.1887
quadrupole: -4.9560 -0.6917 5.6478 -0.4870 -0.1817 -0.1887
hfenergy: -555.5876706 hartree
pointgroup: C01 [X(C10H19Br1O2)]
dipole: 1.2530691 -0.9869062 -0.4316698 debye
polarizability: 191.3027255|-12.9952273|108.9066938|-8.4585731|7.5622698|96.6378703 unknown
InChI: InChI=1S/C10H19BrO2/c1-2-13-10(12)8-6-4-3-5-7-9-11/h2-9H2,1H3
charge 0 multiplicity 1
32 atoms
Br -7.527787 0.557614 0.576381
O  4.159789 -0.574027 -0.770161
O  3.225061 1.238766 0.36641
C  -2.0267 0.233954 0.102202
C  -0.767186 -0.591346 -0.244323
C  -3.33939 -0.563936 -0.072846
C  0.539772 0.213477 -0.07579
C  -4.59221 0.27663 0.288458
C  1.787739 -0.621448 -0.422562
C  -5.8735 -0.536499 0.101305
C  3.089089 0.13732 -0.214666
C  5.520211 0.026849 -0.602959
C  6.130474 -0.374714 0.742872
H  -1.952847 0.594239 1.148843
H  -2.059827 1.139626 -0.537828
H  -0.846127 -0.958592 -1.289143
H  -0.732682 -1.49386 0.401762
H  -3.416254 -0.916783 -1.122185
H  -3.304018 -1.472247 0.563873
H  0.510597 1.11471 -0.718577
H  0.625467 0.583403 0.963452
H  -4.519539 0.621119 1.337368
H  -4.629855 1.181902 -0.346656
H  1.829288 -1.534599 0.20563
H  1.757011 -0.980572 -1.468657
H  -5.924931 -1.412598 0.766793
H  -6.037583 -0.840651 -0.944389
H  6.089207 -0.380533 -1.453963
H  5.432515 1.124097 -0.691582
H  7.165143 0.009536 0.813608
H  5.548843 0.050214 1.578049
H  6.162428 -1.472854 0.849282
