program: Gaussian 09
title: 000264808
version: EM64L-G09RevD.01
frameworkgroup: C1[X(C10H12BrN)]
method: RPBEPBE
basis: SDD
operation: Freq
keyword: #p
keyword: freq=noraman
keyword: PBEPBE/SDD
title: #p freq=noraman PBEPBE/SDD
converged: YES YES NO NO
title: Mulliken charges:
elementType: Br N C C C C C C C C C C H H H H H H H H H H H H
charge: -0.029602 -0.450102 -0.032639 -0.406900 -0.548281 0.377629 0.264421 -0.727164 -0.357847 -0.414534 -0.244551 -0.174586 0.216253 0.201251 0.218533 0.220377 0.231066 0.286030 0.227827 0.211159 0.221834 0.246804 0.220018 0.243003
chargesum: 0.00000
title: Mulliken charges with hydrogens summed into heavy atoms:
elementType: Br N C C C C C C C C C C
charge: -0.029602 -0.164072 0.183614 0.012884 -0.096838 0.377629 0.264421 -0.066344 -0.111043 -0.194516 -0.244551 0.068417
polarizability: 2.06468233e+02 -2.80431841e+00 1.20342545e+02 3.05281104e+00 1.68022941e+00 6.69111162e+01
1716.lowfreq: -12.6867 -7.9353 -0.0001 0.0002 0.0004 14.6438 48.5811 116.0049 145.2844
frequency: 47.4915 116.0007 145.2683 154.1287 224.1640 235.0173 237.0566 281.0274 313.6691 382.4128 406.4796 417.7738 439.6784 469.7021 518.7763 534.9901 587.8370 649.8475 710.2277 748.3831 798.7945 807.4913 846.2011 884.2002 911.8928 929.8912 946.0531 959.9468 1027.2076 1069.0930 1078.6140 1097.4262 1139.3415 1163.4008 1191.6545 1199.4189 1219.7574 1261.9894 1291.7517 1312.6010 1325.9965 1335.6582 1344.9655 1372.9586 1386.6274 1408.4445 1456.3870 1458.5421 1467.8632 1474.3517 1479.0551 1495.7042 1584.3979 1609.7755 2897.8840 2963.9643 2975.8276 2995.3917 3034.8916 3060.9203 3068.4057 3089.7463 3120.4047 3142.4140 3167.7816 3561.3452
redmass: 3.9473 5.1222 4.2931 3.7742 2.5751 1.1791 3.2254 3.1468 4.2274 1.5672 1.8337 3.5610 2.9972 3.5405 3.3410 3.5652 3.6601 4.4256 3.4606 4.3876 1.5440 2.1555 3.3078 1.4064 2.0285 1.3491 1.8075 1.5526 2.0682 2.3295 2.3825 1.7600 1.5414 1.9022 1.4298 2.2057 1.4203 1.3026 1.8875 1.3210 1.4189 1.3947 1.7092 3.4733 1.2400 3.6096 1.1374 1.1978 1.2328 1.1117 1.3081 2.8079 5.9416 6.6981 1.0831 1.0657 1.0365 1.0612 1.0942 1.1037 1.0984 1.0999 1.0891 1.0919 1.0952 1.0768
irintensity: 0.6675 0.9090 1.2781 2.9777 1.9670 0.1349 3.0321 3.0204 1.7832 69.7798 35.9411 0.5868 6.1362 3.4536 4.1652 9.2107 2.2176 17.9065 0.5368 5.3697 51.4983 14.4815 10.7757 9.2027 5.7760 0.4166 4.6466 5.2767 5.4167 6.5723 13.2365 5.0751 25.7105 17.7962 11.1430 11.4769 6.8410 5.5352 52.6931 5.4234 16.5645 91.2664 1.6568 7.9752 28.1758 21.0579 5.2202 28.0826 14.3843 6.0731 14.9873 308.7318 9.8963 54.4243 73.6204 33.0531 34.9531 34.8394 30.3969 38.0850 35.7924 45.5675 18.4484 5.2008 7.2422 24.8963
temp: 298.150 k
press: 1.00000 atm
elementType: 35 7 6 6 6 6 6 6 6 6 6 6 1 1 1 1 1 1 1 1 1 1 1 1
symmnumber: 1
zpe: 514611.7 jmol-1
zpe.correction: 0.196005 hartree
zpe.thermalcorrener: 0.207210 hartree
zpe.thermalcorrenthalpy: 0.208154 hartree
zpe.thermalcorrgfe: 0.158212 hartree
zpe.sumelectzpe: -455.600872 hartree
zpe.sumelectthermal: -455.589668 hartree
zpe.sumelectthermalent: -455.588724 hartree
zpe.sumelectthermalfe: -455.638665 hartree
dipole: -5.1042 0.3859 -0.2860
dipole: 5.1268
quadrupole: -75.5583 -72.0344 -84.8850
quadrupole: -0.6431 1.1612 0.0395
quadrupole: 1.9343 5.4582 -7.3924 -0.6431 1.1612 0.0395
hfenergy: -455.7968777 hartree
pointgroup: C01 [X(C10H12Br1N1)]
dipole: 1.9937102 0.2744476 0.1348705 debye
dipolederiv: -0.7640879 -0.1273615 -0.0270282 -0.1768509 -0.1278399 -0.0059822 -0.0280185 -0.0050846 -0.0634672 -1.7474964 -0.1352937 -0.0401449 -0.2343558 -0.2153971 0.0065132 0.1782883 0.0112466 -0.4753799 0.7242731 -0.119822 0.0869245 -0.4961879 0.2349974 -0.0788963 0.1038407 -0.050752 0.3767918 -0.0029377 -0.0734451 0.0197112 0.0288422 -0.0058795 -0.0257694 -0.0175415 -0.0257902 0.1029901 0.0018046 -0.0215397 0.0108417 -0.0331252 0.0638498 0.0130446 -0.0261118 0.0431547 0.1704612 -0.2345671 -0.0370242 0.0232804 -0.5355877 0.0880088 -0.0297433 0.0957514 -0.034959 -0.1033996 1.5875517 0.2929168 0.0344191 0.6398019 -0.0571526 0.0340355 -0.004982 0.035252 0.1029575 -0.1019953 -0.0190994 0.0437331 -0.0060048 0.0568627 0.0307241 0.019769 0.0269139 0.0639174 -0.0846247 -0.0665341 0.0066632 -0.0998996 0.0512833 -0.0241507 -0.0084686 -0.0154882 -0.0930417 -0.3883845 -0.1655662 0.0101342 0.1946795 0.0785221 -0.0134613 -0.0320348 -0.0246353 -0.2199866 1.0362042 0.2736581 0.0538156 0.3923606 -0.1048921 0.01938 0.0429619 0.013663 -0.1646128 -0.193989 0.0415277 -0.0089994 -0.0124298 0.1272266 -0.0128975 -0.0061255 -0.0091505 -0.091009 -0.1002823 -0.0000081 -0.0049656 0.1459949 0.0098119 0.050494 -0.1451506 0.0465882 -0.2181176 -0.12421 0.1420125 -0.0176379 0.1477102 -0.0285585 0.0111316 -0.0397219 0.0296194 0.0759778 0.0760289 -0.025133 -0.0112676 -0.0479054 0.0541428 0.0570084 0.0252623 -0.0011494 -0.147804 -0.0057881 0.0757996 -0.035981 0.0527477 0.0298781 0.0430264 -0.0290566 0.0967088 -0.128031 -0.0019263 -0.0807404 -0.0332297 -0.0264464 -0.1059987 -0.0672044 -0.0007817 -0.1099746 0.0490363 0.1339522 0.0260446 -0.0191346 0.0609945 0.0679974 -0.0006048 -0.0720484 -0.0251778 0.3071589 0.1017604 0.001486 -0.0583264 -0.0203811 0.0819298 0.0150966 0.0200328 0.0409079 -0.1404515 0.0686173 -0.0323458 0.0009839 -0.1194236 -0.1363232 -0.0845223 -0.0186259 -0.1016242 0.0396608 -0.0990625 0.0782001 -0.0173103 0.1606576 -0.0059995 0.034666 -0.0413726 0.0380346 0.0877711 0.1005198 -0.0228132 -0.0008328 -0.0465185 -0.0664613 0.0071478 0.0010951 0.0030961 0.1455323 0.0068252 -0.0977894 -0.0039398 -0.0604805 -0.1070065 0.0097742 -0.0054735 0.0059466 0.1645925 0.0118147 0.0928704 -0.0117086 0.0918081 0.0169984 0.0111899 -0.0114878 0.0126538 0.1584531 unknown
polarizability: 205.7105315|8.0483934|120.9154389|4.9111892|-2.4029988|67.0959231 unknown
InChI: InChI=1S/C10H12BrN/c1-7-2-3-8-6-9(11)4-5-10(8)12-7/h4-7,12H,2-3H2,1H3
charge 0 multiplicity 1
24 atoms
Br -4.434783 -0.526545 -0.126346
N  1.558571 1.030036 0.107275
C  2.648651 0.058812 0.320295
C  2.245333 -1.292553 -0.316619
C  0.889686 -1.779817 0.243562
C  -0.180953 -0.702188 0.121204
C  0.207594 0.674917 0.068949
C  3.958963 0.615607 -0.265775
C  -1.551018 -1.03556 0.055383
C  -0.799646 1.676676 -0.036201
C  -2.529384 -0.026862 -0.044693
C  -2.165185 1.333811 -0.091442
H  2.795688 -0.112132 1.412717
H  3.035286 -2.038448 -0.11078
H  2.178415 -1.163188 -1.414138
H  1.018898 -2.061915 1.309117
H  0.565653 -2.696006 -0.284067
H  1.796348 2.021654 0.12173
H  3.865784 0.757574 -1.357705
H  4.222457 1.589067 0.191062
H  4.794705 -0.079888 -0.072093
H  -1.849103 -2.089483 0.083861
H  -0.512042 2.73465 -0.076946
H  -2.926616 2.114983 -0.171253
