program: Gaussian 09
title: 000264834
version: EM64L-G09RevD.01
frameworkgroup: C1[X(C13H25N3O2)]
method: RPBEPBE
basis: SDD
operation: Freq
keyword: #p
keyword: freq=noraman
keyword: PBEPBE/SDD
title: #p freq=noraman PBEPBE/SDD
converged: YES YES NO NO
title: Mulliken charges:
elementType: O O N N N C C C C C C C C C C C C C H H H H H H H H H H H H H H H H H H H H H H H H H
charge: -0.393337 -0.290667 -0.097535 -0.341127 -0.083802 -0.457465 -0.351216 -0.350886 -0.457076 -0.359290 -0.334074 -0.383940 -0.389799 -0.527893 -0.488702 0.341789 0.023206 -0.650031 0.211119 0.204588 0.187772 0.207362 0.205247 0.185600 0.198992 0.210810 0.241479 0.164735 0.214231 0.217444 0.207783 0.238336 0.201248 0.202555 0.244064 0.223447 0.201527 0.239125 0.191915 0.227286 0.241222 0.349525 0.374435
chargesum: 0.00000
title: Mulliken charges with hydrogens summed into heavy atoms:
elementType: O O N N N C C C C C C C C C C C C C
charge: -0.018903 -0.290667 -0.097535 0.008398 -0.083802 -0.041759 0.043918 0.039961 -0.047275 0.046924 0.097602 0.062180 0.014003 -0.060382 -0.048050 0.341789 0.023206 0.010392
polarizability: 1.68441636e+02 1.31200377e+01 2.10473440e+02 5.75661253e+00 1.93450588e+00 1.45611208e+02
1716.lowfreq: -5.6779 -0.0010 -0.0009 -0.0007 7.8910 15.1461 46.3017 47.5042 49.4072
frequency: 46.2604 47.4697 49.3554 84.3680 101.2622 134.0165 148.6554 161.0921 164.8328 175.2666 191.9192 194.6533 214.9233 220.7448 260.0407 278.4376 282.6313 298.9472 310.1770 325.3788 332.5591 361.9322 377.5775 379.5761 427.9166 435.2515 456.5670 507.9234 570.9073 582.8979 632.5813 685.6550 700.1427 722.8134 729.5133 768.4462 789.0226 815.6264 827.7106 834.2586 860.9417 877.7963 915.9454 923.4241 946.1664 967.6860 985.9936 1007.8724 1015.8800 1030.5449 1048.1868 1068.3504 1071.4031 1084.2888 1099.8667 1108.5581 1115.2392 1136.6201 1147.8868 1166.3835 1173.7613 1192.9718 1210.8044 1227.4567 1250.0123 1261.4106 1266.3997 1269.0079 1288.1709 1292.5006 1301.5787 1306.9103 1315.6736 1322.6398 1329.4720 1339.6750 1344.0324 1349.8061 1353.0914 1354.5047 1365.5620 1369.4365 1386.5969 1420.6415 1428.6353 1448.0787 1454.2766 1457.1236 1461.3805 1463.7910 1467.0213 1468.9284 1474.0333 1476.4024 1479.5165 1485.1189 1489.4118 1554.9922 2832.9493 2842.8990 2857.3400 2949.8361 2968.6204 2971.9103 2977.7183 2981.6451 2982.8207 2990.5876 3004.8840 3008.4674 3012.0732 3020.6231 3027.3120 3030.8144 3032.1839 3041.3350 3046.4502 3058.3267 3066.3005 3083.7633 3085.4998 3302.8975 3493.1022
redmass: 6.0651 3.7818 4.2785 4.4828 2.8016 3.8689 2.9709 2.9934 2.7582 1.9535 3.0711 2.4820 2.6730 1.8274 3.1989 2.1470 1.7828 2.5974 2.9352 2.0680 2.2715 2.0135 2.8261 2.2463 3.1618 3.3437 4.8593 3.0944 2.6579 2.9679 2.7357 2.6259 1.7435 1.9788 1.6909 2.0358 2.3429 1.7824 1.8539 2.0372 2.0193 2.3162 2.2593 2.0758 2.0307 1.8557 2.1313 2.0452 1.9582 2.1606 2.0109 2.0502 2.3633 1.7277 1.6289 1.6392 2.4773 2.1185 1.9948 1.3051 1.4188 1.8744 1.4925 1.5888 1.3596 1.4058 1.2956 1.5297 1.4927 1.8120 1.2547 1.6380 1.2589 1.2881 1.1804 1.3368 1.3238 1.4026 1.5482 1.4258 1.4862 1.5635 1.3214 2.8185 1.1738 1.0797 1.1648 1.0786 1.0764 1.1043 1.0806 1.0912 1.1719 1.0580 1.0992 1.0635 1.0873 4.5687 1.0713 1.0685 1.0609 1.0649 1.0609 1.0610 1.0618 1.0617 1.0653 1.0636 1.0884 1.0906 1.0596 1.0967 1.0958 1.0881 1.0779 1.0988 1.0930 1.1025 1.0998 1.0987 1.1002 1.0774 1.0682
irintensity: 3.5520 1.9505 0.8483 1.0761 3.6684 1.9771 2.2546 0.4765 0.1627 1.3744 0.1562 0.5790 1.3580 0.3796 3.5250 16.8830 104.0151 11.0269 25.8833 20.4568 0.5945 6.6352 2.1382 4.7799 1.8417 8.2858 7.1231 0.8925 0.3175 2.4778 3.7879 2.0582 8.1349 43.1041 13.9312 79.2385 87.4537 27.8535 10.6404 26.8510 4.3209 16.7078 3.4124 5.8836 10.4641 22.6452 59.2862 1.0441 34.0675 5.2177 30.3419 12.5509 0.4383 8.4066 4.9650 8.2978 8.3420 13.2730 36.3433 5.2419 10.2763 21.0012 15.0283 7.3714 3.8366 1.0104 17.6799 2.5674 44.1011 123.0730 41.8454 38.9099 13.8572 4.4623 3.9123 18.6741 7.6865 12.6100 11.4758 6.5618 3.9093 4.7680 0.1403 31.0656 8.3868 7.5666 3.3725 12.5621 5.1182 1.3761 13.1969 3.4729 20.0192 8.9706 20.9112 7.4337 15.4454 103.2221 40.4515 95.4941 274.6784 48.4680 6.8022 73.9075 67.2598 38.8590 52.5491 23.3338 1.3944 2.2832 21.8691 17.4114 8.4765 36.9692 67.9830 11.8410 64.2587 87.5313 11.6737 22.2577 26.7976 28.4634 22.1679
temp: 298.150 k
press: 1.00000 atm
elementType: 8 8 7 7 7 6 6 6 6 6 6 6 6 6 6 6 6 6 1 1 1 1 1 1 1 1 1 1 1 1 1 1 1 1 1 1 1 1 1 1 1 1 1
symmnumber: 1
zpe: 979619.1 jmol-1
zpe.correction: 0.373117 hartree
zpe.thermalcorrener: 0.392701 hartree
zpe.thermalcorrenthalpy: 0.393645 hartree
zpe.thermalcorrgfe: 0.326314 hartree
zpe.sumelectzpe: -823.484333 hartree
zpe.sumelectthermal: -823.464750 hartree
zpe.sumelectthermalent: -823.463805 hartree
zpe.sumelectthermalfe: -823.531137 hartree
dipole: 4.8654 4.1245 1.6973
dipole: 6.6003
quadrupole: -124.7601 -110.8043 -106.4567
quadrupole: -8.2984 -6.4437 -6.7597
quadrupole: -10.7531 3.2027 7.5503 -8.2984 -6.4437 -6.7597
hfenergy: -823.8574507 hartree
pointgroup: C01 [X(C13H25N3O2)]
dipole: 1.7542958 -1.7873363 -0.6862918 debye
polarizability: 166.2749398|-9.3562456|212.4467418|-5.903786|1.9450422|145.8046023 unknown
InChI: InChI=1S/C13H25N3O2/c1-16-10-6-2-4-8-12(14-17)13(15-18)9-5-3-7-11-16/h14,17H,2-11H2,1H3
charge 0 multiplicity 1
43 atoms
O  -2.63239 -2.599868 1.014538
O  -2.720727 2.606779 1.073937
N  2.554671 -0.038772 0.355295
N  -2.171216 -1.219034 1.030734
N  -2.631267 1.311029 0.947023
C  2.231347 -2.534431 -0.012881
C  3.016236 -1.244504 -0.373291
C  2.964362 1.229832 -0.30049
C  2.167535 2.471647 0.175708
C  0.691727 -2.3555 0.002307
C  0.629608 2.301374 0.137939
C  0.126916 -1.781391 -1.31472
C  0.065374 1.996578 -1.267397
C  -1.408533 -1.477235 -1.313042
C  -1.473077 1.733924 -1.28697
C  -1.874346 -0.606731 -0.169772
C  -1.977948 0.810744 -0.197639
C  2.879847 -0.075008 1.793865
H  2.555256 -2.912852 0.976924
H  2.518725 -3.314005 -0.74792
H  4.1088 -1.440394 -0.212859
H  2.894785 -1.041886 -1.454384
H  2.80949 1.099711 -1.388753
H  4.058358 1.433031 -0.158703
H  2.472759 3.323768 -0.46637
H  2.473609 2.74354 1.205534
H  0.430577 -1.667286 0.826777
H  0.221313 -3.339558 0.217938
H  0.14543 3.213993 0.537083
H  0.353553 1.472855 0.817038
H  0.324495 -2.48291 -2.150445
H  0.664866 -0.845954 -1.5384
H  0.589467 1.117272 -1.684742
H  0.280218 2.843697 -1.950946
H  -1.969178 -2.428553 -1.26685
H  -1.664857 -0.977887 -2.263718
H  -1.765447 1.361855 -2.288223
H  -1.994777 2.696917 -1.121056
H  3.981696 -0.034114 1.991325
H  2.486701 -0.999827 2.250842
H  2.407972 0.777199 2.311622
H  -2.664009 -0.610907 1.714754
H  -1.881417 -3.111038 1.422794
