program: Gaussian 09
title: 000264805
version: EM64L-G09RevD.01
frameworkgroup: C1[X(C9H17N3)]
method: RPBEPBE
basis: SDD
operation: Freq
keyword: #pfreq=noraman
keyword: PBEPBE/SDD
title: #p freq=noraman PBEPBE/SDD
converged: YES YES NO NO
title: Mulliken charges:
elementType: N N N C C C C C C C C C H H H H H H H H H H H H H H H H H
charge: -0.320570 -0.394599 -0.082082 0.362247 -0.529090 -0.481775 -0.403729 -0.375725 -0.387360 -0.336835 -0.705760 -0.134797 0.221582 0.235525 0.227331 0.219429 0.193725 0.206558 0.201522 0.215746 0.194005 0.205278 0.269432 0.324658 0.203065 0.211758 0.227607 0.214502 0.218352
chargesum: 0.00000
title: Mulliken charges with hydrogens summed into heavy atoms:
elementType: N N N C C C C C C C C C
charge: -0.051138 -0.069941 -0.082082 0.362247 -0.071983 -0.035015 -0.003445 0.041542 0.011923 0.077989 -0.045300 -0.134797
polarizability: 1.22125560e+02 -5.86404072e+00 1.19093985e+02 -1.98853571e+00 4.86173044e+00 9.50772156e+01
1716.lowfreq: -26.7530 -14.3016 0.0005 0.0006 0.0009 6.2527 33.3183 64.9728 97.4968
frequency: 32.6572 64.7910 97.2621 117.9897 129.0206 164.5419 196.8517 241.5582 252.6085 283.4799 299.8550 317.2089 357.6168 408.1419 419.8572 453.1163 482.4736 509.7652 553.0948 597.9212 639.4612 755.8379 777.0291 799.6720 816.0723 846.5040 881.6534 900.2222 924.9814 931.4597 973.5736 1051.1930 1061.8254 1070.6814 1094.9966 1116.0823 1125.3190 1139.2780 1145.8527 1149.0665 1179.1880 1230.1865 1250.4460 1262.8656 1270.7970 1274.5393 1319.5888 1338.7173 1339.9466 1342.9579 1355.8184 1365.3947 1380.8127 1393.5500 1459.5172 1461.5680 1462.7405 1466.5459 1474.9220 1478.6168 1481.1825 1486.7273 1502.7945 2176.3528 2914.1014 2968.3532 2970.5659 2979.0465 2980.9544 2989.2209 2990.9729 3011.2331 3030.6987 3036.6817 3039.5550 3054.3766 3061.5706 3075.1115 3091.8884 3432.9785 3545.4042
redmass: 5.7745 2.5583 2.0323 3.6938 3.2652 2.4675 1.8539 1.4122 1.3196 2.5858 2.6569 2.9843 2.0265 3.2237 2.7636 3.2038 3.2245 2.7804 2.9931 2.3127 2.0604 4.2051 1.4684 2.3487 1.1450 2.0711 1.7426 2.4384 1.6843 1.5571 2.3990 2.1670 1.9961 1.5721 1.6413 2.9334 2.1885 2.0953 1.5444 1.9024 3.4931 1.8409 1.3241 1.1841 1.2883 1.2825 1.3800 1.3971 1.4866 1.4949 1.3884 1.4245 1.4479 1.2335 1.0899 1.0886 1.0898 1.1027 1.0791 1.0882 1.0923 1.1232 1.0880 12.1429 1.0690 1.0664 1.0604 1.0609 1.0370 1.0633 1.0646 1.0892 1.0959 1.0971 1.1014 1.1020 1.1001 1.0988 1.1002 1.0744 1.0770
irintensity: 10.5167 1.1866 1.3854 5.0415 1.6118 6.6253 27.1620 71.7988 19.7840 0.1455 2.5170 0.8777 2.6368 13.5123 0.2287 0.0820 1.8338 5.7134 9.2604 84.8407 54.8323 4.5221 2.6798 17.2200 4.5847 7.2208 36.7948 10.1492 3.8624 2.1807 8.4684 1.9466 2.5123 0.7321 1.7923 47.7384 12.2656 18.7813 19.4854 8.3363 76.3914 1.3656 13.3998 9.7107 7.4236 2.3927 1.0644 3.1065 7.8187 3.9451 2.4184 7.9826 77.1014 14.1619 3.4471 6.9146 11.0689 10.4482 16.0868 28.0988 2.7514 7.7223 4.3279 173.3186 61.1111 28.1739 38.3484 19.1180 31.0061 52.2296 12.4172 25.2468 66.5076 53.6235 7.0162 23.8873 76.2003 49.9924 34.9622 1.4254 26.4178
temp: 298.150 k
press: 1.00000 atm
elementType: 7 7 7 6 6 6 6 6 6 6 6 6 1 1 1 1 1 1 1 1 1 1 1 1 1 1 1 1 1
symmnumber: 1
zpe: 664579.8 jmol-1
zpe.correction: 0.253125 hartree
zpe.thermalcorrener: 0.266403 hartree
zpe.thermalcorrenthalpy: 0.267347 hartree
zpe.thermalcorrgfe: 0.213452 hartree
zpe.sumelectzpe: -516.430229 hartree
zpe.sumelectthermal: -516.416951 hartree
zpe.sumelectthermalent: -516.416007 hartree
zpe.sumelectthermalfe: -516.469902 hartree
dipole: 1.5599 -4.2961 -1.1048
dipole: 4.7021
quadrupole: -71.3736 -92.1148 -69.5271
quadrupole: 5.2720 -0.4985 1.3765
quadrupole: 6.2982 -14.4430 8.1448 5.2720 -0.4985 1.3765
hfenergy: -516.6833539 hartree
pointgroup: C01 [X(C9H17N3)]
dipole: 0.7617846 1.6331779 0.4180246 debye
polarizability: 123.0372799|5.3726814|118.2153823|3.3213877|4.2093805|95.0440979 unknown
InChI: InChI=1S/C9H17N3/c1-2-11-9(12-8-10)6-4-3-5-7-9/h11-12H,2-7H2,1H3
charge 0 multiplicity 1
29 atoms
N  -1.213879 0.782105 -0.647015
N  -0.172036 -0.816642 0.955535
N  -1.31306 -2.991572 0.287763
C  0.042384 0.302098 -0.076081
C  0.792947 1.434378 0.67493
C  0.913255 -0.252316 -1.237722
C  2.225616 1.038512 1.108136
C  2.328377 -0.667728 -0.783783
C  3.054659 0.503701 -0.083381
C  -2.272196 1.294073 0.253645
C  -3.553612 1.581429 -0.547936
C  -0.767064 -1.974961 0.632292
H  0.204964 1.765782 1.55332
H  0.839261 2.290223 -0.023195
H  0.979084 0.543473 -2.004031
H  0.391466 -1.113714 -1.701927
H  2.19209 0.263669 1.901992
H  2.721299 1.920378 1.557453
H  2.909159 -1.0076 -1.66201
H  2.258263 -1.529668 -0.092009
H  3.215747 1.324327 -0.812957
H  4.054807 0.182483 0.264949
H  -1.590635 0.122028 -1.341751
H  0.116572 -0.659047 1.922052
H  -2.501283 0.576704 1.075554
H  -1.920214 2.231063 0.725148
H  -3.353887 2.309439 -1.354231
H  -3.950445 0.656068 -1.007702
H  -4.340742 1.992515 0.10856
