program: Gaussian 09
title: 000264886
version: EM64L-G09RevD.01
frameworkgroup: C1[X(C17H19ClN4O7)]
method: RPBEPBE
basis: SDD
operation: Freq
keyword: #p
keyword: freq=noraman
keyword: PBEPBE/SDD
title: #p freq=noraman PBEPBE/SDD
converged: YES YES NO NO
title: Mulliken charges:
elementType: Cl O O O O O O O N N N N C C C C C C C C C C C C C C C C C H H H H H H H H H H H H H H H H H H H
charge: 0.027812 -0.264491 -0.287258 -0.291221 -0.269025 -0.257065 -0.234422 -0.262944 -0.194068 -0.035352 -0.019991 0.062457 -0.082967 -0.113136 -0.060112 -0.471662 0.000021 -0.379714 0.137352 -0.184159 0.130411 0.334249 0.316015 -0.305793 0.327575 -0.768723 -0.756286 -0.354429 -0.758827 0.305347 0.303900 0.245160 0.253454 0.268282 0.268975 0.243718 0.271423 0.288003 0.243949 0.289842 0.245777 0.252008 0.254897 0.253120 0.256235 0.245356 0.279226 0.247082
chargesum: 0.00000
title: Mulliken charges with hydrogens summed into heavy atoms:
elementType: Cl O O O O O O O N N N N C C C C C C C C C C C C C C C C C
charge: 0.027812 -0.264491 -0.287258 -0.291221 -0.269025 -0.257065 -0.234422 -0.262944 -0.194068 -0.035352 -0.019991 0.062457 0.222380 0.190764 0.185048 0.050074 0.268996 0.135428 0.137352 0.103844 0.130411 0.334249 0.316015 -0.305793 0.327575 0.010845 0.003739 -0.098194 0.012837
polarizability: 3.19392391e+02 9.53118759e-02 2.22560706e+02 -1.11326766e+01 -3.66173103e+01 1.88455712e+02
1716.lowfreq: -7.3682 -4.8499 -1.4914 -0.0003 0.0016 0.0021 3.0600 9.7666 22.1354
frequency: -6.1438 9.1470 22.0828 30.2828 35.2205 42.8765 56.3328 59.1440 68.0839 83.9212 88.8377 93.6085 101.7605 114.7004 115.0331 122.4004 147.6221 160.7717 171.1099 179.1080 200.5378 212.5106 228.1386 244.1020 259.2103 259.6640 276.6436 294.1510 308.1311 368.0619 381.1585 399.5521 418.1061 453.0900 476.5502 485.7296 517.1676 546.9556 548.5028 560.2998 561.4335 569.6741 589.6047 601.4869 612.9109 618.3869 625.0127 630.2740 649.1609 658.8425 688.0818 778.3779 789.8426 794.1195 806.0470 807.6482 845.4889 851.6852 863.4033 868.2234 886.0415 915.4977 926.4239 942.4080 945.4021 964.3934 991.7300 998.4642 1007.5566 1012.3186 1032.6156 1040.0414 1043.2745 1047.3468 1047.9487 1083.2442 1094.3419 1112.7641 1131.5435 1155.2312 1168.4909 1176.6036 1184.0620 1192.0550 1199.4005 1208.0817 1214.8105 1258.6169 1276.9254 1281.8873 1290.3152 1300.9933 1306.6944 1330.0254 1334.2966 1338.2842 1354.3073 1357.1499 1368.0067 1369.8667 1383.4678 1384.7395 1386.8456 1393.0242 1403.2402 1442.7378 1450.8412 1452.0889 1452.6535 1454.2472 1454.8626 1456.7371 1458.4242 1472.7288 1506.5631 1563.0835 1651.6326 1655.9908 1662.2416 2979.0733 2996.4362 3003.5802 3004.0381 3007.6101 3020.7337 3044.5423 3055.9968 3061.0926 3088.7998 3098.7462 3100.8865 3101.3907 3119.5799 3142.2598 3142.8920 3144.4834 3186.6497 3246.4633
redmass: 1.2747 3.4315 6.9128 8.0316 7.0324 5.8607 4.1338 8.8039 3.7876 4.7468 4.8881 8.7747 5.0510 3.5562 1.1827 1.0248 4.5486 10.2608 7.9171 6.4954 7.6822 7.9891 6.0614 6.9210 4.6889 5.0873 3.9253 3.1337 5.7365 3.8241 10.9416 4.7811 3.3054 3.8550 3.9050 3.9439 3.8047 5.0365 6.5858 3.4070 3.4662 3.4400 4.3610 5.9135 6.2482 5.1074 6.9437 4.8096 4.9150 6.5860 4.2792 5.9452 7.5490 4.6931 5.7636 5.4644 3.5185 1.5435 4.3164 6.4317 3.9358 1.4357 5.2526 3.9427 3.5537 4.3963 1.9507 2.0171 2.1276 4.4589 2.8653 2.5255 1.6581 1.6603 1.6659 2.6878 4.0765 4.9290 2.4920 2.0495 3.6363 2.8719 2.5526 1.5896 2.4318 1.6383 1.6954 1.8297 1.5302 1.9569 1.3377 2.9039 5.2847 1.2757 1.4431 1.4737 1.5121 1.4234 1.6500 3.3935 1.2317 1.2362 1.2442 1.5142 1.9486 1.2048 3.4035 1.0561 1.0639 1.0510 1.0546 1.0565 1.0571 1.0823 9.3657 11.1535 10.0631 9.7473 9.8438 1.0837 1.0851 1.0390 1.0390 1.0381 1.0608 1.0563 1.0843 1.0868 1.1030 1.0953 1.0929 1.0930 1.1088 1.1028 1.1028 1.1016 1.0929 1.0992
irintensity: 0.6280 0.8687 0.3612 0.1157 0.5722 0.1715 1.7262 2.1123 2.0683 7.1247 0.6311 2.0072 3.1954 0.9335 0.8073 0.3965 3.2206 0.3279 2.7015 1.1611 6.2483 2.4459 5.7313 3.6706 3.9794 5.4527 11.4064 7.8325 4.5271 12.2256 5.2266 2.1421 18.3226 1.4017 10.9074 12.0336 2.0891 1.8128 21.4396 4.6276 12.5126 6.4020 2.1589 0.8280 9.9860 2.3266 9.9435 11.4494 19.0812 1.0731 13.7155 30.6885 2.6478 27.8314 13.7142 17.0048 19.0063 15.7707 15.6839 95.9238 83.5717 12.1069 34.9985 44.8385 72.3921 26.3779 85.3838 33.0880 74.3862 346.8658 41.0483 13.3341 12.8150 19.6555 6.1208 45.4495 29.9321 10.4332 7.8688 13.3858 97.8870 32.5163 482.1020 97.4392 357.0768 141.7801 78.1696 17.1455 37.5104 17.3745 15.7890 66.8451 33.9236 5.6858 8.6293 6.1847 0.5665 29.1758 9.0970 19.5974 78.7282 79.2865 43.7583 19.2546 53.0364 40.7675 130.9884 23.1655 31.5251 21.3622 10.9204 23.8401 7.1424 17.0652 133.1546 111.9260 121.4413 222.5613 161.5253 18.9498 3.4169 2.5641 0.0778 0.7869 7.3559 19.2139 16.6008 0.6699 8.6171 5.9250 8.1647 5.1182 7.4864 6.2943 7.5525 7.2607 8.3369 1.3940
temp: 298.150 k
press: 1.00000 atm
elementType: 17 8 8 8 8 8 8 8 7 7 7 7 6 6 6 6 6 6 6 6 6 6 6 6 6 6 6 6 6 1 1 1 1 1 1 1 1 1 1 1 1 1 1 1 1 1 1 1
symmnumber: 1
zpe: 932314.9 jmol-1
zpe.correction: 0.355100 hartree
zpe.thermalcorrener: 0.382884 hartree
zpe.thermalcorrenthalpy: 0.383829 hartree
zpe.thermalcorrgfe: 0.292540 hartree
zpe.sumelectzpe: -1862.697887 hartree
zpe.sumelectthermal: -1862.670103 hartree
zpe.sumelectthermalent: -1862.669159 hartree
zpe.sumelectthermalfe: -1862.760448 hartree
dipole: -5.2395 2.6048 -1.5712
dipole: 6.0585
quadrupole: -208.0042 -179.2998 -168.6129
quadrupole: 9.8102 1.9488 -10.8429
quadrupole: -22.6986 6.0059 16.6927 9.8102 1.9488 -10.8429
hfenergy: -1863.0529874 hartree
pointgroup: C01 [X(C17H19Cl1N4O7)]
dipole: -2.3305852 0.1224388 0.4847718 debye
polarizability: 293.0612138|-39.310787|263.5473113|-10.7701748|-23.6495282|173.8002838 unknown
InChI: InChI=1S/C17H19ClN4O7/c1-8(23)26-5-12-15(28-10(3)25)11(27-9(2)24)4-13(29-12)22-7-21-14-16(18)19-6-20-17(14)22/h6-7,11-13,15H,4-5H2,1-3H3
charge 0 multiplicity 1
48 atoms
Cl 6.982398 -2.301924 -0.4434
O  0.490101 0.440701 0.617193
O  -1.547953 1.888861 -1.053361
O  -2.133287 -1.705083 -0.38593
O  -2.322209 2.205779 2.227469
O  -3.80445 2.503632 -0.979142
O  -2.508306 -2.832701 -2.393846
O  -2.207756 4.370453 1.347905
N  2.124126 -0.915035 -0.369556
N  4.275634 -0.351663 -0.959532
N  2.549126 -3.128577 0.654883
N  4.917598 -3.731938 0.587753
C  -1.850989 0.676929 -0.247385
C  -1.609174 -0.537653 -1.164468
C  -0.929023 0.639792 0.986013
C  -0.115262 -0.748581 -1.467119
C  0.685478 -0.803066 -0.152494
C  -0.925864 1.938979 1.800664
C  2.927506 -1.981401 0.03927
C  2.987488 0.030344 -0.951715
C  4.264848 -1.616731 -0.346003
C  -2.632356 2.7572 -1.331644
C  -2.556801 -2.817644 -1.146481
C  5.244573 -2.582765 -0.027844
C  -2.863694 3.470357 1.917645
C  -2.148126 3.995719 -2.037268
C  -3.029646 -3.925797 -0.236656
C  3.600589 -3.960914 0.904637
C  -4.314472 3.535695 2.32244
H  -2.90791 0.707515 0.071134
H  -2.188468 -0.449964 -2.099726
H  -1.266257 -0.212835 1.612934
H  0.233995 0.103102 -2.07912
H  0.025267 -1.677232 -2.046137
H  0.382308 -1.680228 0.454716
H  -0.320063 1.813178 2.711808
H  -0.545181 2.782454 1.201661
H  2.6236 0.985036 -1.323165
H  -1.237331 3.797313 -2.621833
H  -1.910748 4.75033 -1.264002
H  -2.945364 4.398233 -2.680398
H  -3.664547 -3.524978 0.569967
H  -2.158529 -4.414257 0.236775
H  -3.582587 -4.674284 -0.822209
H  3.38071 -4.906332 1.405771
H  -4.58834 4.573094 2.567501
H  -4.92376 3.211259 1.458095
H  -4.525094 2.866433 3.1699
