program: Gaussian 09
title: 000264804
version: EM64L-G09RevD.01
frameworkgroup: C1[X(C9H17NS2)]
method: RPBEPBE
basis: SDD
operation: Freq
keyword: #p
keyword: freq=noraman
keyword: PBEPBE/SDD
title: #p freq=noraman PBEPBE/SDD
converged: YES YES NO NO
title: Mulliken charges:
elementType: S S N C C C C C C C C C H H H H H H H H H H H H H H H H H
charge: 0.158570 0.158513 0.000233 0.073384 -0.448402 -0.452158 -0.403843 -0.406296 -0.380878 -0.702045 -0.695991 -0.842977 0.233113 0.206615 0.206773 0.211243 0.205754 0.200442 0.198178 0.198622 0.200436 0.200882 0.188354 0.289396 0.271632 0.270537 0.286101 0.289734 0.284079
chargesum: 0.00000
title: Mulliken charges with hydrogens summed into heavy atoms:
elementType: S S N C C C C C C C C C
charge: 0.158570 0.158513 0.000233 0.306497 -0.035014 -0.035161 -0.005224 -0.007239 0.008359 -0.141018 -0.139353 -0.269164
polarizability: 1.51681557e+02 1.55639960e-01 1.32285190e+02 -9.94883731e+00 3.09734247e-02 1.11308394e+02
1716.lowfreq: -20.4374 -10.9367 -5.5591 -0.0021 -0.0017 0.0019 21.6296 60.4555 95.7043
frequency: 10.7673 60.2923 95.6828 127.6620 198.4339 210.6945 253.1271 284.3330 307.0071 324.7142 364.0315 409.8854 430.4902 438.4757 467.9310 495.6908 535.7704 557.4659 619.5064 622.2901 641.7580 764.1902 787.1689 800.3340 840.6953 865.2230 869.7111 896.0880 899.8465 928.1952 952.1510 998.4155 1056.4611 1060.3433 1082.8333 1087.0059 1109.0754 1117.4282 1148.7510 1152.4970 1193.8301 1204.4707 1242.6600 1251.1688 1258.9020 1262.1465 1265.5326 1284.4663 1302.6950 1316.7022 1332.2794 1337.5221 1344.2096 1345.8819 1348.1132 1369.2016 1401.4600 1437.1364 1455.3377 1463.9605 1464.8484 1466.5603 1473.8775 1481.4445 2921.2480 2969.1056 2971.3667 2971.9560 2972.6930 2976.8853 3026.4571 3031.3327 3031.9434 3037.7332 3038.6948 3042.8486 3042.9628 3050.6935 3130.8156 3142.8626 3145.3911
redmass: 3.2502 4.1313 8.5864 3.0878 2.6954 1.7719 5.3326 4.5660 2.8728 2.2087 3.8935 2.5152 2.9526 3.6843 2.2162 1.9884 6.1442 2.4962 7.3066 5.2753 7.9239 2.3558 1.4339 1.4448 3.0307 1.7454 1.5409 2.2740 1.3287 2.2201 2.1171 2.2020 1.1892 1.8934 1.5228 2.2369 1.6199 2.0032 2.2904 1.2304 1.2953 1.1011 1.3274 1.2913 1.2511 1.1630 1.1648 1.3831 1.2270 1.3507 1.5667 1.3668 1.5075 1.5013 1.5494 1.4463 1.0748 1.0884 1.1003 1.0844 1.0878 1.0927 1.0803 1.0962 1.0814 1.0630 1.0625 1.0613 1.0624 1.0626 1.0596 1.0971 1.0956 1.0660 1.0946 1.0992 1.0696 1.1023 1.1061 1.1023 1.1037
irintensity: 0.1018 1.9077 0.4303 2.4151 1.1670 0.1101 3.1749 3.1007 3.6728 2.8192 0.2207 3.6326 0.4051 6.9114 1.1220 3.2370 4.0360 11.3181 5.0814 105.4637 34.2580 10.4221 0.0794 3.2193 3.3222 26.6470 5.8057 1.2394 7.7028 0.1952 38.5675 0.3644 0.7017 4.0083 9.1714 75.6670 33.5456 3.8551 1.0952 5.3846 1.4320 2.1309 2.9152 19.2977 8.3220 23.2256 12.2809 12.8362 1.0316 0.0126 15.8264 0.9964 0.6405 3.1093 3.0897 12.7150 6.9206 17.2807 40.2927 1.9534 6.3824 6.7011 13.7487 2.4715 9.8770 36.6703 32.3618 21.6710 35.6441 24.8692 53.9710 68.6607 67.2106 12.6835 0.1874 11.3183 70.3677 93.4464 2.4535 9.5771 4.9982
temp: 298.150 k
press: 1.00000 atm
elementType: 16 16 7 6 6 6 6 6 6 6 6 6 1 1 1 1 1 1 1 1 1 1 1 1 1 1 1 1 1
symmnumber: 1
zpe: 656043.0 jmol-1
zpe.correction: 0.249874 hartree
zpe.thermalcorrener: 0.262308 hartree
zpe.thermalcorrenthalpy: 0.263253 hartree
zpe.thermalcorrgfe: 0.209677 hartree
zpe.sumelectzpe: -1203.049659 hartree
zpe.sumelectthermal: -1203.037224 hartree
zpe.sumelectthermalent: -1203.036280 hartree
zpe.sumelectthermalfe: -1203.089856 hartree
dipole: -1.4118 -0.0262 1.8116
dipole: 2.2969
quadrupole: -86.1926 -93.1594 -89.1690
quadrupole: -0.0560 3.3470 -0.0621
quadrupole: 3.3144 -3.6524 0.3380 -0.0560 3.3470 -0.0621
hfenergy: -1203.2995329 hartree
pointgroup: C01 [X(C9H17N1S2)]
dipole: -0.5267706 -0.0034791 0.7342611 debye
polarizability: 150.8287846|0.1862877|132.280658|-11.511109|-0.5072548|112.1656988 unknown
InChI: InChI=1S/C9H17NS2/c1-2-4-9(5-3-1)10-6-11-8-12-7-10/h9H,1-8H2
charge 0 multiplicity 1
29 atoms
S  2.408621 1.622321 -0.754694
S  2.456219 -1.55859 -0.743472
N  0.72143 0.011732 0.936766
C  -0.506613 -0.014926 0.06296
C  -1.358656 -1.277541 0.351735
C  -1.35668 1.2654 0.265841
C  -2.663207 -1.298043 -0.479831
C  -2.66243 1.230172 -0.564093
C  -3.505876 -0.024527 -0.253411
C  1.505856 1.228643 0.935849
C  1.544781 -1.179532 0.945561
C  3.45022 0.047095 -0.738985
H  -0.177738 -0.050583 -1.001777
H  -1.600578 -1.303267 1.434017
H  -0.786294 -2.193613 0.115611
H  -0.781842 2.161118 -0.03392
H  -1.59811 1.36614 1.344037
H  -3.246872 -2.202692 -0.222343
H  -2.40863 -1.379139 -1.556707
H  -2.408238 1.240052 -1.644015
H  -3.244779 2.150563 -0.366369
H  -4.414426 -0.04482 -0.88553
H  -3.845926 0.010849 0.802277
H  0.896965 2.120357 1.126651
H  2.308702 1.157598 1.688605
H  2.346645 -1.076245 1.695542
H  0.965594 -2.088669 1.145681
H  4.069374 0.053226 -1.647247
H  4.094089 0.059722 0.156659
