program: Gaussian 09
title: 000264803
version: EM64L-G09RevD.01
frameworkgroup: C1[X(C9H17NO4)]
method: RPBEPBE
basis: SDD
operation: Freq
keyword: #p
keyword: freq=noraman
keyword: PBEPBE/SDD
title: #p freq=noraman PBEPBE/SDD
converged: YES YES NO NO
title: Mulliken charges:
elementType: O O O O N C C C C C C C C C H H H H H H H H H H H H H H H H H
charge: -0.417553 -0.230745 -0.416019 -0.236946 -0.280557 -0.393575 -0.354419 -0.372034 -0.370902 -0.486940 -0.352673 -0.485406 0.172409 0.186594 0.182804 0.220928 0.189721 0.187498 0.179553 0.212105 0.218067 0.217260 0.238719 0.251375 0.252984 0.233877 0.195119 0.270440 0.237271 0.375765 0.375282
chargesum: 0.00000
title: Mulliken charges with hydrogens summed into heavy atoms:
elementType: O O O O N C C C C C C C C C
charge: -0.041788 -0.230745 -0.040737 -0.236946 -0.041838 0.010157 0.022799 0.019625 0.064425 0.017419 0.076323 0.022305 0.172409 0.186594
polarizability: 1.62617842e+02 -1.56309717e+00 1.11372743e+02 -6.14413847e-01 7.84369425e-01 8.18337006e+01
1716.lowfreq: -19.1936 -5.0374 -0.0007 0.0007 0.0009 5.2946 12.9374 18.5528 27.1107
frequency: 9.1027 17.4716 26.4122 32.9951 48.4463 63.9587 85.4358 97.9726 112.6517 135.7370 154.0540 163.4693 165.3371 258.9497 319.5385 370.9745 457.1775 463.0590 500.2046 505.8608 521.7290 585.0966 593.7909 637.2117 645.9704 686.5462 726.7581 760.4750 794.8936 837.2077 857.1788 867.5771 948.0636 996.5499 1007.3699 1023.0104 1046.5993 1053.9012 1069.4442 1080.3085 1087.9133 1108.0824 1121.1475 1140.7614 1149.7057 1197.6647 1223.5075 1228.7685 1243.7514 1254.7529 1266.6243 1277.0460 1286.1305 1291.1562 1298.9919 1322.7188 1348.7427 1365.5232 1372.2313 1400.9491 1437.8628 1441.4584 1455.0399 1465.1784 1468.0159 1481.6522 1488.6129 1497.1605 1667.0369 1669.3556 2849.9496 2880.8993 2953.9451 2961.1579 2986.4717 2995.1479 2996.9521 2997.9458 2999.4012 3029.8550 3031.8100 3041.2404 3057.2098 3063.3970 3413.9287 3510.4410 3512.5672
redmass: 5.0726 5.6701 3.8473 4.4810 4.0165 1.8478 4.9203 2.9442 1.9440 2.2403 2.4642 5.7571 5.5887 5.2080 5.3665 4.4741 4.4108 3.4346 1.8641 2.3587 2.2889 4.4088 4.2050 1.3230 1.3817 1.3242 1.0991 1.1754 1.2875 1.3206 4.8362 4.4688 1.3192 4.0448 3.3432 2.8710 2.3495 2.5230 2.1233 2.2110 2.2416 2.0133 1.9565 1.3440 3.4521 1.4973 1.3239 1.3524 1.4748 1.4984 1.1899 1.1172 1.1137 1.0923 1.4116 1.5899 1.6187 1.6757 1.8524 1.5622 1.0846 1.0830 1.2131 1.0664 1.0844 1.0950 1.0938 1.0837 8.2412 8.2370 1.0712 1.0719 1.0599 1.0644 1.0613 1.0788 1.0673 1.0605 1.0957 1.0986 1.0888 1.1011 1.0982 1.1032 1.0739 1.0639 1.0639
irintensity: 1.7341 0.2777 1.2099 0.5682 0.0843 0.5887 0.1692 0.4962 0.9069 1.4137 2.6527 1.4601 4.7808 0.9818 9.1837 8.7217 2.8787 3.0253 35.4993 15.6797 62.2504 45.2312 6.6015 125.6594 124.6089 80.8062 19.9283 0.7242 9.6613 4.7911 2.4465 3.7236 3.5962 13.5527 7.1511 460.6602 15.5826 13.1089 3.4724 61.3649 61.0996 4.9760 0.5797 40.2961 17.5225 2.6334 20.5600 13.0196 0.9603 20.0756 2.0219 1.3373 0.6503 0.2349 14.7048 43.4926 0.7744 70.6764 43.1321 13.4823 28.2079 33.6955 19.9535 0.1887 1.2821 13.8698 2.9727 8.0816 202.6432 218.0012 90.3534 109.4153 7.4490 43.3395 5.1221 13.6378 54.3142 12.0573 10.2519 3.1132 7.1623 34.4334 24.0658 84.9371 2.1009 19.3431 18.4925
temp: 298.150 k
press: 1.00000 atm
elementType: 8 8 8 8 7 6 6 6 6 6 6 6 6 6 1 1 1 1 1 1 1 1 1 1 1 1 1 1 1 1 1
symmnumber: 1
zpe: 676298.9 jmol-1
zpe.correction: 0.257589 hartree
zpe.thermalcorrener: 0.274580 hartree
zpe.thermalcorrenthalpy: 0.275524 hartree
zpe.thermalcorrgfe: 0.206977 hartree
zpe.sumelectzpe: -707.680557 hartree
zpe.sumelectthermal: -707.663566 hartree
zpe.sumelectthermalent: -707.662621 hartree
zpe.sumelectthermalfe: -707.731168 hartree
dipole: 0.2232 -0.3647 1.1063
dipole: 1.1860
quadrupole: -78.9330 -95.3939 -82.7343
quadrupole: -14.2217 -1.9567 1.2989
quadrupole: 6.7541 -9.7068 2.9528 -14.2217 -1.9567 1.2989
hfenergy: -707.9381452 hartree
pointgroup: C01 [X(C9H17N1O4)]
dipole: 0.0861905 0.1813516 -0.4212053 debye
polarizability: 162.6027806|1.7793471|111.0288444|0.6029009|3.3403473|82.1926606 unknown
InChI: InChI=1S/C9H17NO4/c11-8(12)4-2-1-3-6-10-7-5-9(13)14/h10-11,13H,1-7H2
charge 0 multiplicity 1
31 atoms
O  6.825436 0.695624 0.12802
O  5.84305 -1.403385 -0.002464
O  -6.731095 -0.949684 -0.048934
O  -5.936463 1.190746 0.369567
N  -1.89556 -0.370561 -0.066718
C  0.593434 -0.310479 -0.01439
C  1.861902 0.571056 -0.0045
C  -0.707837 0.513251 -0.060716
C  3.162554 -0.260907 0.028345
C  4.419232 0.629474 0.051028
C  -3.191706 0.338064 -0.099703
C  -4.34101 -0.676378 0.033022
C  5.71248 -0.161412 0.054123
C  -5.698476 -0.01463 0.135394
H  0.629671 -0.990269 -0.892558
H  0.570933 -0.95692 0.884058
H  1.830815 1.24645 0.87605
H  1.863524 1.226329 -0.900871
H  -0.677076 1.202345 -0.943814
H  -0.769449 1.157127 0.839451
H  3.163334 -0.922021 0.9160
H  3.203585 -0.931515 -0.851216
H  -1.828607 -1.070658 -0.820745
H  4.441719 1.307081 -0.825734
H  4.424349 1.293345 0.9376
H  -3.228844 1.040659 0.752905
H  -3.340598 0.95459 -1.020225
H  -4.180478 -1.287333 0.942935
H  -4.359349 -1.388523 -0.813601
H  7.657522 0.148334 0.123699
H  -7.608396 -0.4902 0.057695
