program: Gaussian 09
title: 000264800
version: EM64L-G09RevD.01
frameworkgroup: C1[X(C9H13NO4)]
method: RPBEPBE
basis: SDD
operation: Freq
keyword: #p
keyword: freq=noraman
keyword: PBEPBE/SDD
title: #p freq=noraman PBEPBE/SDD
converged: YES YES NO NO
title: Mulliken charges:
elementType: O O O O N C C C C C C C C C H H H H H H H H H H H H H
charge: -0.215843 -0.108596 -0.395808 -0.223259 -0.125964 -0.412818 -0.274463 -0.356514 -0.349998 0.115634 0.045367 -0.338903 0.183231 -0.691169 0.236709 0.276048 0.311292 0.213613 0.253629 0.223355 0.199375 0.192195 0.206727 0.220853 0.210445 0.217838 0.387024
chargesum: 0.00000
title: Mulliken charges with hydrogens summed into heavy atoms:
elementType: O O O O N C C C C C C C C C
charge: -0.215843 -0.108596 -0.008783 -0.223259 -0.125964 0.099939 0.036829 0.110729 0.072731 0.115634 0.045367 0.060019 0.183231 -0.042034
polarizability: 1.47300461e+02 -1.35531995e+00 1.17144937e+02 4.94508406e+00 -5.63525636e+00 8.76133269e+01
1716.lowfreq: -12.3078 -4.2605 -0.0007 -0.0004 0.0005 1.6804 22.6368 30.3949 48.9261
frequency: 21.4454 30.3403 48.7935 59.3850 59.9978 103.8401 128.5533 137.2746 217.2611 218.7114 244.3196 275.8427 281.1689 328.3043 378.2154 398.5267 449.0375 519.1410 576.6461 590.1046 618.7251 630.2392 687.8084 705.1126 735.4961 789.8430 810.4513 843.3407 901.1337 919.7376 963.0215 1008.7783 1016.3850 1033.0592 1040.0313 1071.0523 1092.9230 1112.4887 1120.9875 1170.4709 1196.9299 1208.2937 1235.7043 1248.4041 1271.6103 1273.9523 1291.1333 1308.9319 1345.1353 1347.9439 1363.3869 1393.0515 1398.4683 1455.2567 1468.7690 1476.5368 1477.2312 1487.3796 1491.8593 1639.3043 1651.3583 1689.6538 2967.6818 2974.1546 2977.0138 2981.6897 2993.4550 3012.8597 3030.3583 3039.9998 3052.8760 3064.5638 3074.5593 3077.7031 3518.6413
redmass: 2.6819 4.9931 2.0501 8.3236 7.8470 2.3530 3.9118 6.6193 1.9181 1.5137 3.5815 5.5497 2.7950 11.9935 5.5147 4.3282 4.5660 3.2583 4.5404 4.4537 3.6488 1.8553 4.4059 5.7800 1.0918 1.2584 5.3366 3.8309 1.7495 1.4311 3.2743 3.8279 1.9084 3.7116 2.9122 2.5582 2.4828 2.3754 2.0263 1.2946 1.6943 1.4000 1.4455 1.7411 1.8233 1.4098 1.0725 1.3804 1.9563 1.6592 1.3831 1.2112 2.0841 1.0810 1.0721 1.0589 1.0473 1.0845 1.1010 10.0838 9.0173 12.3657 1.0592 1.0609 1.0377 1.0631 1.0582 1.0977 1.0861 1.0996 1.1036 1.1023 1.1010 1.0996 1.0642
irintensity: 1.6396 0.7511 0.4215 0.7069 3.0068 0.2190 1.0998 3.1845 0.3261 0.4161 0.7385 4.7233 1.9288 2.1259 9.9718 3.6505 16.6569 36.9094 41.4302 5.0446 14.9647 102.0428 24.1467 2.8786 9.5354 0.1556 3.1126 10.0596 6.8500 3.3477 6.5796 80.3701 14.8043 106.8987 115.2399 0.4453 87.8954 9.1637 25.8594 17.6885 1.6901 53.5554 26.5568 11.8926 46.0324 18.1953 2.5091 2.8273 59.5194 49.2631 1.8088 10.5700 4.0538 9.9639 0.9547 9.1600 10.4846 17.5475 6.0016 93.8707 396.9934 181.4240 18.4213 7.5764 29.1961 73.4559 27.0794 5.2797 5.5521 14.8544 10.4589 3.2782 82.7615 50.3110 42.3807
temp: 298.150 k
press: 1.00000 atm
elementType: 8 8 8 8 7 6 6 6 6 6 6 6 6 6 1 1 1 1 1 1 1 1 1 1 1 1 1
symmnumber: 1
zpe: 561191.2 jmol-1
zpe.correction: 0.213746 hartree
zpe.thermalcorrener: 0.228627 hartree
zpe.thermalcorrenthalpy: 0.229571 hartree
zpe.thermalcorrgfe: 0.168909 hartree
zpe.sumelectzpe: -705.333129 hartree
zpe.sumelectthermal: -705.318248 hartree
zpe.sumelectthermalent: -705.317304 hartree
zpe.sumelectthermalfe: -705.377966 hartree
dipole: 1.7015 -4.3991 3.7249
dipole: 6.0101
quadrupole: -73.1000 -98.5944 -81.9423
quadrupole: 6.6710 -1.5860 2.0969
quadrupole: 11.4455 -14.0488 2.6033 6.6710 -1.5860 2.0969
hfenergy: -705.5468753 hartree
pointgroup: C01 [X(C9H13N1O4)]
dipole: -0.7554368 1.909179 1.172837 debye
dipolederiv: -0.4967836 -0.3503519 -0.039704 0.0476364 -1.0478909 -0.1501128 0.0450071 -0.1524337 -0.3610432 -0.6773777 0.3600816 0.1379855 0.1425147 -0.6192299 -0.1121375 0.1382273 -0.2412621 -0.3401817 -1.3252173 -0.1233857 -0.2632745 -0.0524171 -0.3184982 -0.0806482 -0.1733753 -0.0522468 -0.3327752 -0.6658477 -0.0467007 -0.0434841 0.0422989 -0.6344819 0.2872569 -0.066043 0.4520266 -0.6408748 -0.7211005 0.2491736 0.0823766 -0.0224359 -0.7201007 -0.0800462 0.0033951 -0.2248291 -0.3836724 0.1920289 0.2076938 0.0239944 0.1105976 0.3526884 0.0664636 0.0690753 0.1260699 0.3103017 -0.295265 -0.3436565 0.0585358 -0.3821078 -0.7444537 0.005043 0.1396697 -0.0799331 -0.0705233 0.5138 -0.0922638 -0.0619544 0.049553 0.0537727 -0.0240374 -0.0923662 0.0538665 0.3000081 -0.0886159 0.0363925 0.018666 -0.0103401 0.1518214 0.0650382 0.0739868 0.0188811 0.0173693 0.3167632 0.1058797 -0.0553191 -0.2233895 1.2914312 0.29249 -0.0915181 0.3164387 0.2764259 0.835502 -0.393797 -0.1454234 0.1078962 1.1170231 0.2422345 -0.055732 0.5162854 0.3094237 0.1165886 0.0075827 -0.0205176 0.067154 0.1232167 0.0454172 -0.1187473 0.0722484 0.1128865 1.7003222 0.4145597 0.2218103 0.2254435 0.7939148 -0.4851112 -0.0022893 -0.7668987 0.7524565 -0.0547316 0.050153 -0.0467515 0.0151586 0.0735404 0.0355121 -0.0012781 0.0246268 0.0335164 0.0490271 -0.0091529 0.05344 -0.0018793 0.0084735 -0.0644625 0.0474555 -0.1211014 -0.0856574 0.1046145 0.003106 -0.0403209 0.03882 -0.0357218 0.0153368 -0.066048 0.0743143 0.0151569 0.0693892 0.0126918 -0.0357816 0.0322003 0.1183362 0.0029462 -0.0239054 0.0435271 0.0355266 -0.0169329 0.0312425 0.0217695 0.0377228 0.0556173 -0.1109556 0.0476336 -0.0673363 -0.1194574 0.0321281 -0.0104717 0.004346 -0.0843604 -0.0260863 0.0461031 -0.0201584 -0.0114854 0.08863 0.0408986 0.0230839 0.0342318 0.0299041 0.0327298 -0.0732661 0.0354338 -0.0484686 -0.0993567 0.0240239 -0.0707455 0.0005683 -0.087471 -0.1399698 0.033012 -0.0097764 0.014298 0.0537742 0.0263242 0.0142705 0.0040318 0.030734 0.0388272 -0.0931939 0.0494123 -0.0742157 -0.1738293 0.019635 -0.0255466 -0.0033998 -0.0751968 -0.1648094 0.0507508 0.0045877 0.0302237 0.0643036 -0.2299758 0.0212871 0.0110908 0.0083316 0.0895765 0.016679 0.0271916 0.0180359 0.0744587 0.0785421 -0.0958573 -0.0014852 -0.0375253 -0.1609248 0.0396913 -0.0227312 0.0085683 0.0688002 0.0945128 0.032788 0.0579454 0.0251349 0.0349064 -0.1017532 0.0019012 -0.0657794 -0.1301562 0.3577475 -0.0080569 0.0266235 -0.0339773 0.2762917 0.1317498 0.0609917 0.1365792 0.2244893 unknown
polarizability: 147.6194031|-1.3358457|118.0576013|-2.8577962|0.9383022|86.3817204 unknown
InChI: InChI=1S/C9H13NO4/c1-2-3-4-10-5-6(9(13)14)7(11)8(10)12/h6,13H,2-5H2,1H3
charge 0 multiplicity 1
27 atoms
O  -0.262565 -2.531213 -0.073903
O  2.597216 -1.609879 -0.403386
O  3.948425 1.340455 0.205733
O  2.198377 2.160255 -1.091599
N  -0.505174 -0.290195 0.663839
C  0.287221 0.949085 0.815662
C  1.761246 0.498184 0.680115
C  -1.958326 -0.316358 0.881877
C  -2.7609 0.40707 -0.226958
C  0.197735 -1.390173 0.196809
C  1.668143 -0.94008 0.074719
C  -4.281789 0.351335 0.042829
C  2.608647 1.427636 -0.164418
C  -5.10226 1.070124 -1.049454
H  0.080684 1.413968 1.796773
H  0.041905 1.678158 0.021054
H  2.246119 0.379355 1.666485
H  -2.17786 0.142933 1.867146
H  -2.251616 -1.38122 0.92274
H  -2.535995 -0.067473 -1.201389
H  -2.441446 1.466208 -0.299811
H  -4.498544 0.808561 1.030155
H  -4.602386 -0.707665 0.110187
H  -6.185483 1.016875 -0.837471
H  -4.823612 2.138403 -1.119343
H  -4.929226 0.612165 -2.040998
H  4.50647 1.886488 -0.41219
