program: Gaussian 09
title: 000264794
version: EM64L-G09RevD.01
frameworkgroup: C1[X(C8H15N)]
method: RPBEPBE
basis: SDD
operation: Freq
keyword: #pfreq=noraman
keyword: PBEPBE/SDD
title: #p freq=noraman PBEPBE/SDD
converged: YES YES NO NO
title: Mulliken charges:
elementType: N C C C C C C C C H H H H H H H H H H H H H H H
charge: -0.109705 -0.073750 -0.433771 -0.412617 -0.374950 -0.374481 -0.634485 -0.099038 -0.606799 0.179701 0.206863 0.214317 0.215938 0.192349 0.191166 0.204512 0.168377 0.210330 0.184227 0.247263 0.218740 0.250807 0.215069 0.219938
chargesum: 0.00000
title: Mulliken charges with hydrogens summed into heavy atoms:
elementType: N C C C C C C C C
charge: -0.109705 0.105951 -0.012590 -0.004331 0.020727 0.004226 0.015745 0.151769 -0.171793
polarizability: 1.12036049e+02 3.52762719e+00 8.58377866e+01 -4.21051562e+00 -1.44953525e+00 7.55334345e+01
1716.lowfreq: -16.7567 -11.3621 -0.0006 -0.0006 -0.0005 22.0467 85.1277 97.9041 162.3862
frequency: 85.0278 97.8348 162.3667 208.0717 257.2051 289.6497 303.4250 329.5452 396.1483 412.6740 445.3983 497.3777 541.7539 662.1807 750.6327 818.6833 851.9197 871.3712 916.5823 941.9300 944.4774 995.2944 1021.2569 1029.5404 1049.7326 1075.6737 1101.0116 1113.3235 1126.6485 1147.2403 1170.9283 1196.8029 1243.0299 1255.3988 1266.0830 1275.9962 1285.7713 1316.4156 1336.7483 1337.3537 1345.5283 1368.1005 1424.2752 1431.5708 1448.7055 1458.6764 1459.8701 1466.8658 1473.4847 1481.2427 1655.4586 2805.5468 2818.3210 2855.2558 2967.4965 2985.3983 2986.3054 3018.9377 3026.0821 3034.2173 3048.4342 3056.4455 3079.0240 3090.0097 3092.5374 3194.1600
redmass: 2.6625 2.6740 2.3296 1.1258 1.9878 1.8224 1.8862 2.6725 2.1203 2.8968 3.2609 3.0370 1.6709 1.7605 2.7663 1.6094 1.6437 2.6527 1.4079 1.8374 1.4680 1.5697 1.1903 1.7039 2.2448 1.8861 1.8287 1.6765 1.6756 1.6218 2.1353 2.1427 1.3878 1.5394 1.3475 1.3857 1.2664 1.2667 1.3909 1.4251 1.5147 1.3950 1.1993 1.1728 1.0905 1.0889 1.0600 1.0848 1.0831 1.0595 4.8307 1.0784 1.0725 1.0576 1.0622 1.0620 1.0614 1.0870 1.0730 1.0959 1.1025 1.1033 1.0682 1.0997 1.0841 1.1142
irintensity: 0.4919 0.0902 1.0064 0.2041 2.1673 2.4137 2.6491 0.7832 1.8552 1.4974 0.4633 1.9133 0.8143 8.6973 7.6010 1.6879 4.9547 5.1880 0.2262 28.3210 59.1605 3.7702 21.7796 33.0552 7.7030 5.2617 14.1499 16.9634 6.3353 3.9084 0.6694 10.4749 0.3797 6.6108 13.0625 4.4209 4.4715 11.4234 0.0658 0.9410 1.8361 4.4812 9.3508 7.8093 7.7076 12.3249 26.2108 2.4239 8.4887 6.9790 11.5617 31.9922 114.3174 159.7715 39.5058 24.0219 33.0866 51.8562 55.7401 54.5138 28.5163 72.1826 19.8992 28.0189 8.1327 27.4969
temp: 298.150 k
press: 1.00000 atm
elementType: 7 6 6 6 6 6 6 6 6 1 1 1 1 1 1 1 1 1 1 1 1 1 1 1
symmnumber: 1
zpe: 563443.8 jmol-1
zpe.correction: 0.214604 hartree
zpe.thermalcorrener: 0.224134 hartree
zpe.thermalcorrenthalpy: 0.225078 hartree
zpe.thermalcorrgfe: 0.180554 hartree
zpe.sumelectzpe: -367.830534 hartree
zpe.sumelectthermal: -367.821005 hartree
zpe.sumelectthermalent: -367.820061 hartree
zpe.sumelectthermalfe: -367.864585 hartree
dipole: 0.3847 0.0015 0.7006
dipole: 0.7993
quadrupole: -55.3418 -56.8078 -56.9547
quadrupole: 0.1591 0.3725 0.3295
quadrupole: 1.0263 -0.4397 -0.5866 0.1591 0.3725 0.3295
hfenergy: -368.0451389 hartree
pointgroup: C01 [X(C8H15N1)]
dipole: -0.1521802 -0.0058741 0.2751093 debye
dipolederiv: -0.6147978 0.0506833 -0.0009042 -0.010691 -0.5990999 0.0568494 0.0489121 0.0142989 -0.5299616 0.1266338 0.1833125 0.0969591 0.3055134 0.4634547 0.0758855 0.0335463 0.0475249 0.3645612 -0.0383717 0.00635 0.0135521 -0.1096906 0.0196949 0.0030479 0.0675754 -0.0080456 0.1449814 0.0255391 -0.0374218 0.0090609 0.0434517 0.0659633 -0.0117559 -0.0447231 0.0112 0.1486689 0.0663766 0.0428879 -0.0246586 0.0366074 0.021583 -0.0143325 0.0104793 0.00384 0.1360232 0.4903518 0.0591066 -0.0978236 0.0197885 0.0840752 -0.0167415 -0.1258911 -0.0501681 0.4228649 0.1301158 -0.1621794 0.0563166 -0.1390151 0.3161672 -0.0672512 0.0264412 -0.0933952 0.3486496 0.2319553 0.0376238 -0.0000104 0.0402141 -0.2042143 0.0213608 -0.0938376 0.0087025 0.124527 -0.1915865 0.0554587 -0.0890044 0.0224238 -0.4086723 0.0307734 -0.0980499 0.0235433 0.0693943 -0.0148067 -0.0375918 -0.0128482 -0.0278244 -0.0496887 0.0303452 -0.0502437 -0.0769238 -0.2673093 0.049005 0.0266002 0.0109809 0.0084636 0.0758489 -0.0153489 0.0211643 0.06047 -0.1614387 -0.0060074 -0.102387 -0.0333924 -0.0840838 -0.1174503 -0.0479421 -0.0384561 -0.0868814 0.0485218 -0.0777786 0.1243042 -0.0311438 0.1291354 -0.1312725 0.0424745 -0.0357143 0.0674442 0.0645882 0.0387133 -0.0297271 -0.0197869 -0.0382483 0.0623864 0.024173 0.0376128 -0.0366701 -0.1969961 -0.2145924 -0.0392033 0.0610202 -0.0443597 0.0335776 0.0123565 0.1097176 0.0127335 0.053535 0.0947989 -0.0019519 0.0090114 0.0099722 0.0241534 0.0135167 -0.0695739 0.0038654 -0.1747985 -0.0683769 0.0161281 -0.0398878 0.0096586 0.0371219 0.0074765 0.1445307 0.0806076 -0.2876698 -0.0073894 -0.0604243 -0.0073231 -0.112705 -0.161029 -0.0611034 -0.0168611 -0.0865948 0.0378037 0.0322826 0.0546287 -0.0020326 0.055926 -0.0318156 -0.0024065 -0.0897982 0.1821264 -0.2536032 -0.1342345 0.0464638 0.0691981 0.0015299 0.1183429 0.0323897 0.077734 0.0292815 0.0474087 0.0425319 -0.1467821 -0.0652239 -0.0550812 -0.1282676 -0.0686296 -0.0551794 -0.0693916 0.0428094 0.0510679 -0.0121701 -0.0249589 0.0150384 0.1490089 -0.0278298 0.0503157 -0.0173943 -0.1091403 -0.0973004 -0.0590227 0.0738004 -0.0647997 0.1861514 0.0019091 0.090777 0.0059077 0.0417772 0.0858704 -0.0146864 0.0490991 -0.011224 0.1739803 -0.0192169 -0.0004777 -0.0260809 -0.1151971 unknown
polarizability: 111.8758162|3.9458071|85.941624|4.3349206|1.6346067|75.5898299 unknown
InChI: InChI=1S/C8H15N/c1-3-8-6-4-5-7-9(8)2/h3,8H,1,4-7H2,2H3
charge 0 multiplicity 1
24 atoms
N  -0.118718 -0.992729 -0.280662
C  0.524293 0.264469 0.21102
C  -0.341664 1.495582 -0.184243
C  -1.796648 1.361169 0.31172
C  -2.402897 0.036806 -0.199044
C  -1.51054 -1.14675 0.216467
C  0.682832 -2.196225 0.03408
C  1.909671 0.425158 -0.385307
C  3.031858 0.730311 0.311813
H  0.612172 0.246874 1.331724
H  -0.334051 1.586102 -1.288365
H  0.135716 2.403938 0.227791
H  -2.397539 2.226331 -0.027365
H  -1.813668 1.369599 1.421446
H  -3.423064 -0.112224 0.204076
H  -2.475875 0.062123 -1.303415
H  -1.530371 -1.241369 1.33643
H  -1.914189 -2.091121 -0.195706
H  0.785666 -2.378054 1.134912
H  1.697214 -2.098629 -0.386684
H  0.202096 -3.083409 -0.416057
H  1.949132 0.321007 -1.481057
H  3.993174 0.890154 -0.189123
H  3.018396 0.832583 1.404547
