program: Gaussian 09
title: 000264792
version: EM64L-G09RevD.01
frameworkgroup: C1[X(C7H15N)]
method: RPBEPBE
basis: SDD
operation: Freq
keyword: #pfreq=noraman
keyword: PBEPBE/SDD
title: #p freq=noraman PBEPBE/SDD
converged: YES YES NO NO
title: Mulliken charges:
elementType: N C C C C C C C H H H H H H H H H H H H H H H
charge: -0.130820 0.415023 -0.493222 -0.456268 -0.398118 -0.752147 -0.750411 -0.649375 0.227657 0.204088 0.217194 0.226028 0.179148 0.217537 0.219183 0.214454 0.224077 0.204730 0.232908 0.209217 0.226799 0.222897 0.189419
chargesum: 0.00000
title: Mulliken charges with hydrogens summed into heavy atoms:
elementType: N C C C C C C C
charge: -0.130820 0.415023 -0.061476 -0.013046 -0.001433 -0.094432 -0.103556 -0.010260
polarizability: 8.48961894e+01 1.02813178e+00 8.29882760e+01 -4.46280093e-02 2.02893543e-01 7.22955426e+01
1716.lowfreq: -23.4865 0.0007 0.0009 0.0010 5.4219 15.1199 91.4389 132.2241 196.0411
frequency: 91.3032 132.1587 195.9900 227.1820 242.9586 250.3680 286.1853 322.1324 340.8720 414.6127 462.3559 560.2197 617.7711 697.8114 758.7842 839.4581 890.2413 906.0703 919.8723 935.7974 974.9276 1001.1236 1045.1071 1052.7959 1106.4830 1130.7096 1146.8699 1186.3892 1197.9842 1214.4608 1229.6255 1237.0469 1250.4784 1294.2439 1312.5819 1345.7107 1365.5395 1382.7551 1429.2429 1455.1081 1460.0733 1464.3479 1470.0437 1475.8939 1482.7254 1488.3844 1491.4756 1505.5897 2843.9475 2860.4616 2973.5094 2977.7832 3002.7211 3004.9568 3011.7802 3019.3018 3059.0292 3065.6274 3068.8609 3071.6970 3074.0389 3082.4754 3087.7783
redmass: 1.7073 2.1727 1.1335 1.6115 1.0837 1.2337 2.3133 2.2488 2.3367 2.2364 2.7055 3.5232 3.9536 3.3868 1.4510 1.8155 1.7713 1.6931 1.9073 1.6847 1.3855 1.6907 2.6101 1.6718 1.2937 1.6554 1.6036 3.4989 1.8976 1.5566 1.7449 1.4323 2.4402 1.4046 1.6958 1.4877 1.2196 1.2169 1.1546 1.0664 1.0579 1.0568 1.0625 1.0591 1.0684 1.0637 1.0600 1.0856 1.0712 1.0582 1.0346 1.0356 1.0792 1.0650 1.0729 1.0654 1.1030 1.0993 1.0996 1.0990 1.0984 1.1040 1.1003
irintensity: 0.1430 1.1565 0.9183 2.8666 0.1022 1.7975 0.1995 2.5879 0.6437 1.2651 6.5495 1.5192 1.6746 5.0227 0.0897 4.9991 2.3342 4.4916 3.0757 3.9259 1.1054 11.5004 3.8404 8.7907 7.6862 13.3181 0.9404 19.4469 29.6976 2.7134 13.1241 17.8670 10.9866 2.5292 16.4055 2.3054 30.9338 17.7008 3.6287 3.3450 2.0070 9.6874 6.4792 27.5335 2.6013 7.9781 0.1113 3.4502 67.8155 165.4590 29.5772 26.0373 20.3445 63.9968 61.0929 43.0405 8.5142 10.5849 16.7446 57.8490 54.6550 27.6147 71.7233
temp: 298.150 k
press: 1.00000 atm
elementType: 7 6 6 6 6 6 6 6 1 1 1 1 1 1 1 1 1 1 1 1 1 1 1
symmnumber: 1
zpe: 547254.6 jmol-1
zpe.correction: 0.208438 hartree
zpe.thermalcorrener: 0.217731 hartree
zpe.thermalcorrenthalpy: 0.218676 hartree
zpe.thermalcorrgfe: 0.175340 hartree
zpe.sumelectzpe: -329.806357 hartree
zpe.sumelectthermal: -329.797064 hartree
zpe.sumelectthermalent: -329.796120 hartree
zpe.sumelectthermalfe: -329.839456 hartree
dipole: 0.0499 -0.1288 0.7477
dipole: 0.7604
quadrupole: -50.5931 -50.3961 -53.4632
quadrupole: -0.3043 -0.0562 0.3561
quadrupole: 0.8910 1.0880 -1.9791 -0.3043 -0.0562 0.3561
hfenergy: -330.0147955 hartree
pointgroup: C01 [X(C7H15N1)]
dipole: 0.0078784 -0.0509938 0.2946736 debye
dipolederiv: -0.5473975 0.0353932 0.0012301 0.0146247 -0.6424794 -0.009037 -0.0345765 -0.0404651 -0.5771158 0.2516019 0.1921253 -0.025843 0.2144063 0.4449263 -0.0670251 -0.0496992 -0.0309922 0.4194253 -0.0546612 0.0495805 0.0050201 0.0202906 0.0563407 -0.0442366 0.0382159 -0.0196021 0.0913189 0.0242217 -0.0351033 -0.0411651 -0.0217512 -0.0378048 -0.0320386 -0.0262102 -0.0538881 0.1490255 0.4644837 0.0876142 0.0357253 0.060943 0.0861305 0.0221848 0.0596279 0.0637783 0.403116 -0.0038442 -0.0564957 0.0347677 -0.0447108 -0.0341327 0.0147007 0.066544 0.0723858 -0.2248386 -0.0643245 -0.0697863 -0.0704894 -0.0431598 0.0379212 -0.0161201 -0.066159 -0.0020071 -0.0351867 0.1351175 -0.1730999 -0.038414 -0.1298006 0.3775256 0.0732356 -0.0179348 0.0902922 0.3792714 0.0380429 -0.0189957 -0.0098771 -0.0156001 0.0527781 -0.0376952 -0.0064702 -0.0931421 -0.1583631 0.0532423 -0.0429258 0.0053102 -0.0288492 -0.1438408 0.0807017 -0.0032991 0.1282402 0.0254991 0.01647 0.0280991 -0.0642381 0.0391839 0.0220225 0.0463539 -0.1343912 0.0728251 -0.1049322 -0.0882039 0.0443297 0.0968149 0.0240451 0.0502369 -0.0188706 0.1523971 -0.0402724 -0.0262815 -0.0438714 0.0178222 -0.0033102 -0.0244678 -0.0160324 -0.0886418 -0.153112 -0.1207662 -0.2504108 -0.0741319 -0.0960508 0.0557785 -0.1299639 -0.0601985 0.0670272 0.0867069 0.100831 -0.0098866 -0.0432237 0.1154232 0.0630299 0.1407509 -0.0224593 -0.0704972 0.0332359 -0.0332165 0.0494044 0.0439015 -0.0878756 0.0366927 -0.1030832 -0.1328132 0.0753052 0.0310197 0.0495949 0.0705856 -0.0697847 -0.0184044 -0.143267 -0.0296225 0.0832217 -0.0373075 -0.1089096 -0.0237941 -0.0176528 -0.0879538 0.1049394 0.0218752 0.1612929 -0.0069222 -0.0300078 0.0479859 -0.0574363 0.0606268 0.0757313 0.0006418 0.0684496 0.0045306 0.0988797 0.0347443 0.0115375 0.0136031 -0.1481553 0.0482056 -0.0595375 -0.0070637 -0.1112209 -0.1464006 0.0169976 0.0094165 0.0526908 0.0820444 -0.1508994 0.0641576 -0.0843159 -0.0115664 0.1086947 -0.0206324 -0.0746331 -0.0241899 0.046236 0.0483338 -0.1375848 0.0660165 -0.0528037 -0.1296351 0.0732968 0.0572404 0.0839083 0.0285374 0.0289439 0.0557335 -0.0027273 0.0665321 -0.0459588 -0.0324376 0.0814672 -0.1883775 -0.2522674 unknown
polarizability: 85.0534718|0.8430985|82.8262101|0.2843924|0.1845901|72.3003262 unknown
InChI: InChI=1S/C7H15N/c1-7(2)5-4-6-8(7)3/h4-6H2,1-3H3
charge 0 multiplicity 1
23 atoms
N  0.059962 0.848692 -0.369351
C  -0.567574 -0.461359 0.018064
C  0.595369 -1.435458 -0.328622
C  1.90252 -0.657879 0.0142
C  1.4651 0.834718 0.106274
C  -0.925815 -0.550465 1.534229
C  -1.821477 -0.736747 -0.837093
C  -0.670535 2.08718 -0.071478
H  0.558261 -1.662602 -1.408989
H  0.508221 -2.387333 0.225099
H  2.335235 -0.996497 0.972314
H  2.668984 -0.810734 -0.764376
H  1.557676 1.200475 1.160872
H  2.082755 1.503121 -0.52328
H  -1.684634 0.205072 1.810327
H  -1.340983 -1.546597 1.774332
H  -0.035714 -0.390535 2.170845
H  -2.657654 -0.063857 -0.56932
H  -1.585887 -0.591387 -1.906109
H  -2.171049 -1.775158 -0.688868
H  -1.692405 2.037939 -0.487006
H  -0.156255 2.938523 -0.55527
H  -0.7479 2.321186 1.020408
