program: Gaussian 09
title: 000264880
version: EM64L-G09RevD.01
frameworkgroup: C1[X(C27H24O2)]
method: RPBEPBE
basis: SDD
operation: Freq
keyword: #pfreq=noraman
keyword: PBEPBE/SDD
title: #p freq=noraman PBEPBE/SDD
converged: YES YES NO NO
title: Mulliken charges:
elementType: O O C C C C C C C C C C C C C C C C C C C C C C C C C C C H H H H H H H H H H H H H H H H H H H H H H H H
charge: -0.214061 -0.214006 0.151691 0.068589 0.068329 0.340166 0.340176 -0.674814 -0.802419 -0.832565 -0.832578 -0.017591 -0.017505 -0.276259 -0.276453 -0.270601 -0.270356 0.468013 0.467967 -0.377764 -0.383943 -0.377799 -0.383914 -0.237169 -0.239167 -0.237113 -0.239170 -0.233623 -0.233639 0.240265 0.226666 0.226580 0.274109 0.234085 0.233835 0.246838 0.233851 0.234088 0.246829 0.236185 0.236211 0.268936 0.268920 0.229065 0.239618 0.229103 0.239618 0.229976 0.232629 0.229975 0.232631 0.233775 0.233788
chargesum: 0.00000
title: Mulliken charges with hydrogens summed into heavy atoms:
elementType: O O C C C C C C C C C C C C C C C C C C C C C C C C C C C
charge: -0.214061 -0.214006 0.151691 0.068589 0.068329 0.340166 0.340176 -0.434549 -0.075064 -0.117806 -0.117809 -0.017591 -0.017505 -0.040074 -0.040242 -0.001665 -0.001436 0.468013 0.467967 -0.148698 -0.144324 -0.148697 -0.144296 -0.007192 -0.006538 -0.007138 -0.006539 0.000152 0.000149
polarizability: 5.46092914e+02 -9.08830158e-02 2.73077318e+02 -4.19559845e-02 2.81267526e+01 2.59346698e+02
1716.lowfreq: -34.2831 -29.1391 -4.4839 -4.3781 -1.5149 -0.0008 0.0003 0.0007 14.2563
frequency: -33.9161 -26.4527 12.1066 21.3212 26.2803 26.7370 34.5872 38.4376 43.1137 78.2578 85.9421 88.7456 91.0447 110.4875 121.7359 150.3103 181.7088 183.8186 192.3612 226.0903 238.2910 242.4134 265.7493 277.1002 278.0275 292.0555 300.4231 350.9916 387.2955 393.5880 403.2935 403.3083 458.0186 478.3298 485.8252 489.3552 516.4715 533.4180 548.2974 555.0410 560.7006 590.0472 613.1019 614.2952 621.5592 659.7435 681.1771 692.4498 700.4819 733.4001 754.8368 769.1686 779.7636 788.9505 802.1597 849.0173 849.1069 874.0598 875.8830 882.2378 893.0163 896.8103 930.5851 930.6039 944.4800 981.8473 981.8847 986.4975 988.1271 992.8434 998.6345 998.6846 1015.5464 1015.9205 1017.4385 1021.8740 1025.4631 1025.8622 1027.9543 1039.5640 1041.4802 1048.1260 1052.8685 1083.7136 1083.7830 1148.4404 1174.3365 1174.3576 1190.9399 1191.1469 1218.3210 1218.3931 1223.4337 1235.0494 1296.3217 1297.5773 1299.2087 1310.1386 1318.2812 1335.1813 1335.6994 1345.5067 1385.8028 1386.3962 1396.5243 1400.6920 1402.6861 1408.9993 1428.3426 1439.1457 1439.4432 1461.9982 1462.6373 1470.1155 1474.4526 1477.6160 1478.3509 1484.7345 1484.8958 1522.0645 1527.8058 1558.4768 1580.0366 1580.2132 1599.0212 1609.7663 1609.7952 1634.2373 1637.4062 2977.2242 2977.7521 3003.1208 3056.8451 3057.1058 3086.0779 3086.3902 3086.4507 3093.9648 3093.9733 3104.9227 3115.2867 3125.4978 3125.5251 3127.2772 3127.4150 3131.3834 3131.4480 3142.6250 3142.6561 3153.2986 3153.3434 3167.8784 3167.9266
redmass: 1.4138 1.4283 4.9295 3.5823 2.9867 3.2331 1.2615 2.6811 2.9226 4.3693 4.8908 4.4335 4.4700 4.9875 2.9293 3.9510 4.7214 3.4097 4.0403 6.0487 5.4606 3.9900 4.7972 2.9951 2.8657 5.0832 2.7853 2.9495 5.7237 4.7095 2.7623 2.7626 3.8132 4.5718 2.9375 2.8202 3.3186 3.8460 6.5700 4.3765 5.2479 4.9585 6.3621 6.4380 5.6964 4.8475 3.8302 1.8824 1.8647 2.5163 5.9545 2.1619 2.4382 3.5182 4.6362 1.2796 1.2782 3.6802 1.3664 3.3935 1.8042 1.9196 1.4681 1.4683 2.5981 1.3876 1.3876 4.8130 6.0574 4.0939 1.3166 1.3149 1.2625 2.2569 1.3752 1.4777 2.1987 1.8759 2.1400 1.5751 1.6295 2.0681 1.7750 1.6154 1.6105 3.1671 1.0651 1.0669 1.1247 1.1224 1.5478 1.5507 3.8164 1.4437 1.8475 1.7804 3.8006 1.7970 2.7492 1.2970 1.3184 6.8588 6.8720 6.9990 3.1092 1.2218 1.2742 1.3301 2.0886 2.3108 2.3118 1.0813 1.1363 1.2102 1.1188 1.1062 1.1890 2.2870 2.2952 9.6840 6.7869 6.9725 5.6072 5.6169 6.4039 5.9290 5.9361 5.6080 5.6334 1.0389 1.0389 1.0373 1.0948 1.0948 1.0996 1.0990 1.0972 1.0895 1.0895 1.1004 1.0912 1.0859 1.0859 1.0902 1.0901 1.0881 1.0881 1.0916 1.0916 1.0963 1.0963 1.1016 1.1016
irintensity: 0.0253 1.0430 0.2767 0.1853 0.4757 0.5892 1.9844 0.0751 0.1774 0.5724 0.0456 0.2284 0.9464 9.1011 1.1482 1.8020 3.4407 2.6852 0.2399 0.0230 0.7951 1.1297 2.0086 0.2315 2.3600 15.8079 0.1991 0.0249 0.0121 3.8955 0.0298 0.0401 16.8487 0.5161 0.9409 21.0469 7.2671 0.9902 70.8110 10.7368 8.8095 0.2564 0.0502 0.1254 3.5456 5.7302 17.5019 8.9778 61.6694 44.3950 15.2012 56.0483 1.0081 33.8898 7.0584 0.4884 0.0425 1.7779 16.1943 16.5821 6.7375 4.3504 0.0283 0.0090 3.2504 0.1358 0.2006 50.2935 2.3226 43.6627 0.3979 6.5206 0.6965 1.4958 67.6994 31.2753 7.5435 1.8952 15.3195 0.0159 8.8947 38.1330 14.3294 4.0762 12.4018 375.7692 0.8133 3.6645 30.8573 5.8608 26.6887 14.3734 30.1106 12.7058 88.6502 11.5609 1.8065 99.4013 27.4974 76.0046 29.6157 0.2325 4.9586 35.6142 16.4223 7.5087 7.0071 27.5254 167.6441 16.1589 47.5133 2.7694 29.0065 0.0355 51.5024 33.6812 9.4285 45.1607 17.9255 57.3780 320.2562 41.4829 32.2036 5.3128 235.5699 1.3453 0.6734 396.2894 79.1183 57.7728 16.9485 10.7394 4.0049 43.7029 12.3763 15.4992 23.6202 0.2613 1.5419 27.8191 23.0565 4.3952 5.6239 4.3285 7.3734 2.3850 5.5242 6.4791 7.9480 34.8858 40.7403 38.1806 25.4433
temp: 298.150 k
press: 1.00000 atm
elementType: 8 8 6 6 6 6 6 6 6 6 6 6 6 6 6 6 6 6 6 6 6 6 6 6 6 6 6 6 6 1 1 1 1 1 1 1 1 1 1 1 1 1 1 1 1 1 1 1 1 1 1 1 1
symmnumber: 1
zpe: 1109031.0 jmol-1
zpe.correction: 0.422408 hartree
zpe.thermalcorrener: 0.448773 hartree
zpe.thermalcorrenthalpy: 0.449717 hartree
zpe.thermalcorrgfe: 0.361128 hartree
zpe.sumelectzpe: -1191.682164 hartree
zpe.sumelectthermal: -1191.655798 hartree
zpe.sumelectthermalent: -1191.654854 hartree
zpe.sumelectthermalfe: -1191.743443 hartree
dipole: 0.0000 4.7316 5.0851
dipole: 6.9459
quadrupole: -123.9657 -171.1955 -167.6564
quadrupole: 0.0037 -0.0193 -5.7940
quadrupole: 30.3068 -16.9230 -13.3839 0.0037 -0.0193 -5.7940
hfenergy: -1192.1045711 hartree
pointgroup: C01 [X(C27H24O2)]
dipole: -0.0176542 -1.6871498 -2.1496662 debye
polarizability: 546.0792921|-0.058504|268.2787033|-1.9450891|28.8797344|264.1589348 unknown
InChI: InChI=1S/C27H24O2/c1-19-18-20(2)27(25(29)17-15-23-12-8-5-9-13-23)21(3)26(19)24(28)16-14-22-10-6-4-7-11-22/h4-18H,1-3H3
charge 0 multiplicity 1
53 atoms
O  -2.802585 1.688238 2.056119
O  2.841178 1.684837 2.010916
C  0.009658 1.21076 0.867458
C  -1.225742 1.512172 0.21724
C  1.235287 1.508915 0.19758
C  -1.242919 2.150654 -1.05864
C  1.233888 2.146783 -1.078683
C  -0.008891 2.469351 -1.668965
C  0.020137 0.559761 2.242315
C  -2.536572 2.558327 -1.748063
C  2.517401 2.549703 -1.789512
C  -2.531226 1.194008 0.914298
C  2.550782 1.188779 0.874621
C  -3.454211 0.24795 0.230574
C  3.460901 0.239273 0.178471
C  -4.660801 -0.094916 0.785318
C  4.67542 -0.104515 0.715045
C  -5.657341 -1.031828 0.254911
C  5.661599 -1.045185 0.172135
C  -5.477674 -1.755907 -0.961599
C  -6.864245 -1.232145 0.987023
C  5.460623 -1.774593 -1.037804
C  6.880145 -1.244242 0.885041
C  -6.468696 -2.641716 -1.424086
C  -7.857339 -2.119486 0.523775
C  6.442382 -2.664264 -1.512507
C  7.863983 -2.135394 0.409534
C  -7.663584 -2.8281 -0.684754
C  7.649077 -2.849298 -0.792281
H  -0.01587 3.002325 -2.627899
H  -0.874526 -0.061596 2.409116
H  0.916238 -0.063339 2.394403
H  0.027326 1.334435 3.029089
H  -3.060406 1.692563 -2.195789
H  -2.332231 3.275027 -2.561787
H  -3.245707 3.032935 -1.047073
H  2.30222 3.267701 -2.599284
H  3.029875 1.682015 -2.246582
H  3.240328 3.020966 -1.100462
H  -3.10919 -0.183904 -0.716325
H  3.100106 -0.194023 -0.761877
H  -4.902658 0.394594 1.741142
H  4.933147 0.387359 1.6655
H  -4.558298 -1.62639 -1.542974
H  -7.014789 -0.682634 1.924259
H  4.531829 -1.646587 -1.604391
H  7.047077 -0.690752 1.817145
H  -6.315559 -3.191489 -2.359329
H  -8.777765 -2.259529 1.100791
H  6.272725 -3.218193 -2.442435
H  8.793597 -2.27432 0.97191
H  -8.432499 -3.518871 -1.047883
H  8.410696 -3.543115 -1.164848
