program: Gaussian 09
title: 000264820
version: EM64L-G09RevD.01
frameworkgroup: C1[X(C11H21N3O2)]
method: RPBEPBE
basis: SDD
operation: Freq
keyword: #p
keyword: freq=noraman
keyword: PBEPBE/SDD
title: #p freq=noraman PBEPBE/SDD
converged: YES YES NO NO
title: Mulliken charges:
elementType: O O N N N C C C C C C C C C C C H H H H H H H H H H H H H H H H H H H H H
charge: -0.400210 -0.382723 -0.111711 -0.273302 -0.007858 -0.354891 -0.343234 -0.422658 -0.422414 -0.358035 -0.365973 -0.471302 -0.492347 0.323338 -0.047001 -0.643322 0.193542 0.199419 0.194170 0.192541 0.212279 0.202343 0.202326 0.208351 0.216603 0.228748 0.221840 0.219591 0.235894 0.218711 0.189159 0.241926 0.231226 0.197240 0.228491 0.368263 0.370982
chargesum: 0.00000
title: Mulliken charges with hydrogens summed into heavy atoms:
elementType: O O N N N C C C C C C C C C C C
charge: -0.029228 -0.014460 -0.111711 -0.273302 -0.007858 0.038070 0.043477 -0.008036 -0.011737 0.087316 0.075458 -0.016697 -0.061262 0.323338 -0.047001 0.013635
polarizability: 1.80064315e+02 1.42809721e+00 1.69979636e+02 8.38701032e+00 8.72590582e-01 1.05561582e+02
1716.lowfreq: -7.5166 0.0006 0.0007 0.0009 7.2191 14.1344 43.7106 49.8142 67.7099
frequency: 43.6986 49.8027 67.6196 107.0103 145.5903 162.5929 173.6760 184.7362 188.7955 203.1557 224.3142 243.6829 282.8049 300.8915 338.1072 346.4963 352.2575 373.2862 378.1159 390.1071 394.6103 433.9513 488.2131 515.1599 535.7785 554.5161 642.4044 700.8388 707.5490 718.8880 760.8824 802.0766 813.1294 829.4072 864.1544 871.4104 888.9686 915.9791 940.4412 945.4345 974.6278 1003.9994 1030.4726 1053.1443 1057.7072 1060.1367 1081.1555 1088.1402 1107.2720 1121.3840 1134.7874 1158.7527 1171.8945 1180.5592 1231.4316 1244.4408 1250.7926 1268.4522 1275.3846 1287.7566 1298.0603 1299.7788 1303.0591 1331.5791 1340.2079 1343.7773 1346.5351 1349.0239 1353.2079 1374.8156 1416.9454 1431.3182 1448.5135 1457.0132 1460.6430 1461.7598 1464.4339 1469.3754 1475.3685 1478.8493 1484.5683 1489.1775 1537.4682 1600.6169 2524.7324 2854.8380 2859.3297 2874.8369 2971.0899 2974.1873 3000.0344 3006.7047 3007.4937 3011.9143 3014.3931 3017.6773 3021.1045 3031.8573 3038.1015 3051.5370 3071.2695 3074.4080 3074.8172 3103.6429 3561.4627
redmass: 4.8288 3.5387 4.0125 4.8016 1.5169 3.1894 2.0970 2.8440 2.8671 2.1049 5.6033 3.7108 2.6427 2.4008 2.7242 2.9367 3.7274 2.0579 1.7621 1.8289 1.8890 3.5342 2.6867 5.0026 3.0933 3.9810 4.8507 3.1507 1.5007 1.5364 2.0170 2.4866 2.0146 2.2596 1.3369 2.0199 5.6700 2.2652 2.0779 2.1228 3.0219 2.1696 2.1323 2.0034 2.3703 2.4036 2.2376 2.3427 1.3950 2.1103 1.7251 1.4673 1.3038 1.6768 1.3558 1.4014 1.6245 1.5957 1.3815 1.3930 1.4251 1.3040 1.2360 1.4534 1.3444 1.3351 1.5266 1.7845 1.5396 1.2881 4.7151 1.1593 1.0792 1.0902 1.0934 1.0885 1.0869 1.0771 1.0537 1.0557 1.1091 1.0981 3.6497 1.2895 1.0688 1.0602 1.0689 1.0704 1.0602 1.0605 1.0650 1.0816 1.0627 1.0708 1.0804 1.0721 1.0746 1.0960 1.0930 1.0982 1.0993 1.1006 1.1011 1.0965 1.0674
irintensity: 2.3228 0.1556 0.9880 0.1852 0.3530 0.4190 0.7040 0.2889 1.5185 0.9594 11.5111 0.3245 4.8922 1.1127 3.7208 5.5288 2.1351 32.3966 39.7698 43.9260 11.6317 6.6036 0.7470 16.9593 2.1699 3.8282 3.8879 2.9353 42.2091 8.7167 11.2235 10.0787 4.8156 16.4297 85.4155 33.5602 92.3935 9.6578 2.1933 6.3295 70.5517 46.5125 17.0057 16.4400 2.2263 12.6979 10.3708 1.5915 8.7810 3.2250 33.5775 13.8757 25.7125 15.6140 7.3112 5.2344 54.1383 4.4195 1.4051 2.6590 22.8637 1.5184 1.7119 6.6772 2.5369 4.8879 30.8042 19.4418 2.0014 0.3481 33.9379 10.0861 6.5622 15.9274 0.7545 1.4065 1.9434 5.8418 14.3233 14.3942 2.7117 50.4264 3.0711 77.7348 137.9891 76.9403 86.1225 243.6962 63.2298 52.0510 11.0720 7.7436 26.9698 6.8928 3.9310 4.0359 45.3726 3.3294 145.2296 14.9039 39.6573 22.9417 32.6988 18.2722 63.4888
temp: 298.150 k
press: 1.00000 atm
elementType: 8 8 7 7 7 6 6 6 6 6 6 6 6 6 6 6 1 1 1 1 1 1 1 1 1 1 1 1 1 1 1 1 1 1 1 1 1
symmnumber: 1
zpe: 830354.0 jmol-1
zpe.correction: 0.316265 hartree
zpe.thermalcorrener: 0.333016 hartree
zpe.thermalcorrenthalpy: 0.333960 hartree
zpe.thermalcorrgfe: 0.272802 hartree
zpe.sumelectzpe: -745.060899 hartree
zpe.sumelectthermal: -745.044148 hartree
zpe.sumelectthermalent: -745.043204 hartree
zpe.sumelectthermalfe: -745.104363 hartree
dipole: -3.8245 3.7006 -0.6346
dipole: 5.3594
quadrupole: -102.3019 -99.5315 -96.5565
quadrupole: 17.8086 -0.2780 2.5293
quadrupole: -2.8386 -0.0682 2.9068 17.8086 -0.2780 2.5293
hfenergy: -745.3771641 hartree
pointgroup: C01 [X(C11H21N3O2)]
dipole: 1.5551664 -1.3961129 -0.2799766 debye
polarizability: 179.4047028|1.6990174|170.0824615|-10.4334687|-1.8815292|106.1183685 unknown
InChI: InChI=1S/C11H21N3O2/c1-14-8-4-2-6-10(12-15)11(13-16)7-3-5-9-14/h15-16H,2-9H2,1H3
charge 0 multiplicity 1
37 atoms
O  -2.690539 -2.611425 0.283477
O  -3.93193 1.033613 0.603706
N  2.729102 -0.069831 0.036341
N  -2.773095 -1.154381 0.309829
N  -2.768213 1.686194 0.134359
C  2.64786 -1.323181 -0.742412
C  2.691586 1.201049 -0.717936
C  1.797725 -2.419929 -0.038164
C  1.945962 2.335764 0.040462
C  0.429044 -1.911089 0.472511
C  0.53389 1.926413 0.520509
C  -0.484075 -1.367005 -0.668835
C  -0.498382 1.731581 -0.629279
C  -1.670261 -0.567587 -0.165884
C  -1.713559 0.918997 -0.200538
C  3.716408 -0.101354 1.125333
H  3.658349 -1.74759 -0.965884
H  2.193275 -1.087681 -1.722872
H  2.17368 1.009564 -1.676559
H  3.716312 1.564246 -0.983776
H  2.359093 -2.82735 0.826256
H  1.665565 -3.263415 -0.747148
H  1.892632 3.22067 -0.626832
H  2.545001 2.647705 0.919113
H  0.623042 -1.104233 1.200485
H  -0.104769 -2.721364 1.001776
H  0.131818 2.686442 1.217224
H  0.639677 0.988097 1.09366
H  -0.863529 -2.224061 -1.256364
H  0.109676 -0.7303 -1.340956
H  -0.011636 1.262384 -1.504048
H  -0.864128 2.720081 -0.959502
H  3.590029 0.775264 1.784957
H  4.773491 -0.103765 0.756267
H  3.572209 -1.004016 1.745387
H  -3.752826 -0.002671 0.620894
H  -3.578285 -2.888337 0.629439
