program: Gaussian 09
title: 000264790
version: EM64L-G09RevD.01
frameworkgroup: C1[X(C7H11NO2)]
method: RPBEPBE
basis: SDD
operation: Freq
keyword: #p
keyword: freq=noraman
keyword: PBEPBE/SDD
title: #p freq=noraman PBEPBE/SDD
converged: YES YES NO NO
title: Mulliken charges:
elementType: O O N C C C C C C C H H H H H H H H H H H
charge: -0.223189 -0.223185 -0.356649 -0.438708 -0.134985 -0.134981 0.145649 0.145660 -0.710333 -0.710332 0.219259 0.221532 0.241946 0.241945 0.210653 0.219294 0.254408 0.254401 0.219296 0.210652 0.347666
chargesum: 0.00000
title: Mulliken charges with hydrogens summed into heavy atoms:
elementType: O O N C C C C C C C
charge: -0.223189 -0.223185 -0.008982 0.002083 0.106960 0.106965 0.145649 0.145660 -0.025978 -0.025983
polarizability: 1.11991517e+02 -3.37748446e-04 8.44575989e+01 5.36014219e-04 -2.14471195e+00 6.00073558e+01
1716.lowfreq: -11.0849 -10.8110 -0.0008 -0.0006 -0.0003 12.5506 49.8241 132.7868 137.9966
frequency: 49.8084 132.7862 137.9961 182.4761 185.9838 249.6048 283.3090 323.4037 359.4402 371.7917 404.6762 446.5762 560.3847 618.3372 667.9777 700.3786 712.9356 809.6233 814.8919 885.8279 921.8445 949.0454 1005.3802 1054.1412 1074.0433 1124.7080 1126.6342 1165.5539 1185.6845 1219.0635 1254.8956 1264.2964 1291.8153 1319.7328 1322.9557 1348.1283 1375.3341 1390.8920 1393.1485 1466.4947 1468.8614 1472.7436 1480.0130 1482.5679 1632.1790 1637.4524 2945.7532 2946.4993 2987.5380 2992.4004 2993.4588 3052.1808 3085.5941 3086.1760 3108.2108 3108.3565 3475.0477
redmass: 5.0184 2.3128 7.8298 1.0318 1.0847 2.5127 3.2813 2.5861 5.6251 4.4571 3.7077 5.7733 4.0339 3.6922 4.4642 4.2575 2.5416 2.9242 1.3630 1.5482 1.6046 1.6815 1.3416 2.2081 1.7596 1.5589 3.1288 2.3448 1.6296 2.6152 1.2836 1.8907 1.4723 1.4412 3.2370 1.8130 1.7675 1.2015 1.2205 1.0647 1.0453 1.0581 1.0555 1.0628 11.7559 5.2154 1.0800 1.0816 1.0594 1.0362 1.0390 1.1015 1.1003 1.1001 1.0994 1.0993 1.0757
irintensity: 0.0001 0.1909 7.6969 0.0348 0.0389 2.1694 1.2306 5.7609 17.5196 12.4736 9.4557 0.1571 2.4257 2.1313 4.1228 4.1592 4.5101 8.4632 113.7388 5.5202 0.7412 1.3910 0.1529 0.0609 12.9716 0.3653 0.2441 16.1056 48.9990 311.0808 0.9179 28.3199 5.2951 17.2380 42.1173 29.3009 0.2573 9.4943 47.3105 4.6516 9.0564 24.5105 0.5239 19.6619 107.7802 426.2085 18.4628 0.3331 14.9510 20.1730 51.4246 19.3806 1.2905 66.9128 10.7018 17.2988 30.9723
temp: 298.150 k
press: 1.00000 atm
elementType: 8 8 7 6 6 6 6 6 6 6 1 1 1 1 1 1 1 1 1 1 1
symmnumber: 1
zpe: 455221.2 jmol-1
zpe.correction: 0.173385 hartree
zpe.thermalcorrener: 0.183439 hartree
zpe.thermalcorrenthalpy: 0.184383 hartree
zpe.thermalcorrgfe: 0.138067 hartree
zpe.sumelectzpe: -477.803745 hartree
zpe.sumelectthermal: -477.793690 hartree
zpe.sumelectthermalent: -477.792746 hartree
zpe.sumelectthermalfe: -477.839063 hartree
dipole: -0.0001 -3.6678 0.7068
dipole: 3.7353
quadrupole: -73.7267 -60.9247 -57.7616
quadrupole: 0.0000 -0.0006 -0.4899
quadrupole: -9.5890 3.2130 6.3760 0.0000 -0.0006 -0.4899
hfenergy: -477.9771294 hartree
pointgroup: C01 [X(C7H11N1O2)]
dipole: 0.0003594 1.4487254 0.2466007 debye
dipolederiv: -1.0784762 -0.1272826 -0.0108215 -0.349792 -0.6875107 -0.024684 -0.067956 -0.0559732 -0.3442502 -1.0782365 0.127703 0.0093875 0.3501681 -0.6878836 -0.024036 0.0664668 -0.0557881 -0.3440968 -1.711551 0.0005417 -0.0013643 0.0005052 -0.4517466 0.0081365 -0.0013631 -0.0314613 -0.3179306 -0.0632982 0.0000275 -0.0001948 0.0000326 0.0701711 0.019072 -0.0001933 0.0194496 0.1354367 -0.0122291 -0.0057939 -0.0206497 0.0292985 -0.1917198 -0.0501236 -0.0216084 -0.1127111 0.1516851 -0.0123209 0.0059099 0.0202721 -0.0293281 -0.1916765 -0.0502192 0.0211719 -0.1127638 0.1517622 1.7596569 0.0280414 -0.0003928 -0.206725 0.9323919 0.1076381 -0.0163128 0.1800378 0.2066342 1.759776 -0.0290712 0.0034913 0.2058273 0.9322275 0.108089 0.0194843 0.1800085 0.2066902 -0.0455173 -0.0335772 -0.0170319 -0.0044472 0.0454759 0.022773 0.015144 0.0196689 0.0813478 -0.0454912 0.0335912 0.0167936 0.0044628 0.0454501 0.02277 -0.015386 0.0197527 0.0813465 0.0373267 -0.0000095 0.0001678 0.0000448 0.0823862 -0.0247958 0.0001912 0.0283018 -0.1423127 0.0774253 -0.0000469 -0.0000034 -0.0000706 -0.1717217 -0.032911 -0.0000149 -0.0563318 0.0683693 0.0609442 -0.0056913 -0.0405189 0.0039348 0.0336135 0.009375 -0.0127026 0.021177 -0.1216377 0.0608341 0.0056175 0.0409086 -0.0039843 0.0336039 0.0093459 0.0131018 0.0211891 -0.1215252 0.0834918 0.0001873 -0.0208839 0.0644603 -0.148979 -0.0608999 -0.009229 -0.0726535 0.0652137 0.0713441 0.0189944 0.040861 0.015069 0.087424 -0.0187584 -0.0248017 0.0220104 -0.1441399 -0.057832 -0.0435385 0.0438867 -0.1133382 0.0857648 0.0401714 0.045441 0.034494 0.07531 -0.0575333 0.0435819 -0.0441357 0.113363 0.085629 0.0404461 -0.0456928 0.0346255 0.0751193 0.0713505 -0.0190272 -0.0404216 -0.0150136 0.0874545 -0.0187631 0.0252699 0.0219492 -0.1441673 0.0833787 -0.0002121 0.0208726 -0.0645121 -0.1489268 -0.0610483 0.0092087 -0.0726615 0.0652792 0.0969575 0.0000548 -0.0002225 0.0000448 0.1585725 -0.0215776 -0.0002188 -0.0323203 0.3158662 unknown
polarizability: 111.99146|-0.0129841|84.5393949|0.0522866|1.6103551|59.9256171 unknown
InChI: InChI=1S/C7H11NO2/c1-4-3-5(2)7(10)8-6(4)9/h4-5,8H,3H2,1-2H3
charge 0 multiplicity 1
21 atoms
O  -2.310463 -1.462422 -0.048012
O  2.309446 -1.464311 -0.043514
N  -0.000484 -1.355785 -0.02899
C  0.00083 1.422105 -0.200824
C  -1.285398 0.756565 0.343099
C  1.285414 0.755502 0.34569
C  -1.276982 -0.753253 0.071286
C  1.276316 -0.754289 0.073751
C  -2.576623 1.402578 -0.199712
C  2.578267 1.400505 -0.194422
H  0.001922 1.378447 -1.308542
H  0.000995 2.492317 0.076892
H  -1.282895 0.856853 1.451594
H  1.280698 0.855718 1.454186
H  -2.646671 2.454273 0.130566
H  -2.589759 1.384295 -1.304521
H  -3.465293 0.856077 0.155644
H  3.465769 0.85332 0.162796
H  2.593706 1.382191 -1.2992
H  2.648442 2.452149 0.135991
H  -0.000741 -2.371034 -0.193859
